BDBM50329034 (2-phenoxy-1-phenyl-1H-indol-3-yl)(piperazin-1-yl)methanone::2-phenoxy-1-phenyl-3-(piperazin-1-ylcarbonyl)-1H-indole::CHEMBL1235803
SMILES: O=C(N1CCNCC1)c1c(Oc2ccccc2)n(-c2ccccc2)c2ccccc12
InChI Key: InChIKey=PAQQZWUEZAUGRI-UHFFFAOYSA-N
Data: 1 IC50
PDB links: 1 PDB ID matches this monomer.
Activity Spreadsheet -- Enzyme Inhibition Constant Data from BindingDB
Found 1 hit for monomerid = 50329034
Trg + Lig
Ki
nM
ΔG°
kcal/mole
IC50
nM
Kd
nM
EC50/IC50
nM
koff
s-1
kon
M-1s-1
pHTemp
°C
Renin
(Homo sapiens (Human))
BDBM50329034
((2-phenoxy-1-phenyl-1H-indol-3-yl)(piperazin-1-yl)...)
Show SMILES O=C(N1CCNCC1)c1c(Oc2ccccc2)n(-c2ccccc2)c2ccccc12
Show InChI InChI=1S/C25H23N3O2/c29-24(27-17-15-26-16-18-27)23-21-13-7-8-14-22(21)28(19-9-3-1-4-10-19)25(23)30-20-11-5-2-6-12-20/h1-14,26H,15-18H2
Reactome pathway
n/an/a 420n/an/an/an/an/an/a
Sanofi-Aventis Deutschland GmbH
Curated by ChEMBL
Assay Description
Inhibition of human recombinant renin using flurorogenic substrate by microplate spectrofluorometer
Bioorg Med Chem Lett 20: 6268-72 (2010)
Article DOI: 10.1016/j.bmcl.2010.08.092
BindingDB Entry DOI: 10.7270/Q2VH5P2M
3D
3D Structure (crystal)