BDBM50329045 (2-(3-fluoro-2-methylphenoxy)-1-phenyl-1H-indol-3-yl)(piperazin-1-yl)methanone::CHEMBL1270469
SMILES: Cc1c(F)cccc1Oc1c(C(=O)N2CCNCC2)c2ccccc2n1-c1ccccc1
InChI Key: InChIKey=YWFVKBKVLSZRFL-UHFFFAOYSA-N
Data: 1 IC50
Activity Spreadsheet -- Enzyme Inhibition Constant Data from BindingDB
Found 1 hit for monomerid = 50329045
Trg + Lig
Ki
nM
ΔG°
kcal/mole
IC50
nM
Kd
nM
EC50/IC50
nM
koff
s-1
kon
M-1s-1
pHTemp
°C
Renin
(Homo sapiens (Human))
BDBM50329045
((2-(3-fluoro-2-methylphenoxy)-1-phenyl-1H-indol-3-...)
Show SMILES Cc1c(F)cccc1Oc1c(C(=O)N2CCNCC2)c2ccccc2n1-c1ccccc1
Show InChI InChI=1S/C26H24FN3O2/c1-18-21(27)11-7-13-23(18)32-26-24(25(31)29-16-14-28-15-17-29)20-10-5-6-12-22(20)30(26)19-8-3-2-4-9-19/h2-13,28H,14-17H2,1H3
Reactome pathway
n/an/a 11n/an/an/an/an/an/a
Sanofi-Aventis Deutschland GmbH
Curated by ChEMBL
Assay Description
Inhibition of human recombinant renin using flurorogenic substrate by microplate spectrofluorometer
Bioorg Med Chem Lett 20: 6268-72 (2010)
Article DOI: 10.1016/j.bmcl.2010.08.092
BindingDB Entry DOI: 10.7270/Q2VH5P2M
3D
3D Structure (docked)