BDBM50329082 (Z)-methyl 2-(5-methyl-2-oxo-2H-benzo[b][1,4]oxazin-3(4H)-ylidene)acetate::CHEMBL1269381
SMILES: COC(=O)Cc1nc2c(C)cccc2oc1=O
InChI Key: InChIKey=QBFOJCZZLNOOMK-UHFFFAOYSA-N
Data: 1 IC50
Activity Spreadsheet -- Enzyme Inhibition Constant Data from BindingDB
Found 1 hit for monomerid = 50329082
Trg + Lig
Ki
nM
ΔG°
kcal/mole
IC50
nM
Kd
nM
EC50/IC50
nM
koff
s-1
kon
M-1s-1
pHTemp
°C
1,4-Dihydroxy-2-naphthoyl-CoA synthase
(Mycobacterium tuberculosis)
BDBM50329082
((Z)-methyl 2-(5-methyl-2-oxo-2H-benzo[b][1,4]oxazi...)
Show SMILES COC(=O)Cc1nc2c(C)cccc2oc1=O
Show InChI InChI=1S/C12H11NO4/c1-7-4-3-5-9-11(7)13-8(12(15)17-9)6-10(14)16-2/h3-5H,6H2,1-2H3
n/an/a 2.41E+4n/an/an/an/an/an/a
Stony Brook University
Curated by ChEMBL
Assay Description
Inhibition of Mycobacterium tuberculosis MenB expressed in Escherichia coli BL21 (DE3) by double-reciprocal plot analysis
Bioorg Med Chem Lett 20: 6306-9 (2010)
Article DOI: 10.1016/j.bmcl.2010.08.076
BindingDB Entry DOI: 10.7270/Q2M045PR