BDBM50329221 CHEMBL1270899::N-(3,5-dimethylphenyl)-2-(4-(trifluoromethoxy)phenyl)oxazole-4-carboxamide
SMILES: Cc1cc(C)cc(NC(=O)c2coc(n2)-c2ccc(OC(F)(F)F)cc2)c1
InChI Key: InChIKey=KCCVSMYYGNCIPX-UHFFFAOYSA-N
Data: 3 IC50
Activity Spreadsheet -- Enzyme Inhibition Constant Data from BindingDB
Found 3 hits for monomerid = 50329221
Trg + Lig
Ki
nM
ΔG°
kcal/mole
IC50
nM
Kd
nM
EC50/IC50
nM
koff
s-1
kon
M-1s-1
pHTemp
°C
Voltage-gated sodium channel subunit alpha Nav1.8
(Rattus norvegicus (Rat))
BDBM50329221
(CHEMBL1270899 | N-(3,5-dimethylphenyl)-2-(4-(trifl...)
Show SMILES Cc1cc(C)cc(NC(=O)c2coc(n2)-c2ccc(OC(F)(F)F)cc2)c1
Show InChI InChI=1S/C19H15F3N2O3/c1-11-7-12(2)9-14(8-11)23-17(25)16-10-26-18(24-16)13-3-5-15(6-4-13)27-19(20,21)22/h3-10H,1-2H3,(H,23,25)
n/an/a 2.00E+3n/an/an/an/an/an/a
Abbott Laboratories
Curated by ChEMBL
Assay Description
Inhibition of tetrodotoxin-resistant NaV1.8 in rat DRG neuron by electrophysiology
Bioorg Med Chem Lett 20: 6812-5 (2010)
Article DOI: 10.1016/j.bmcl.2010.08.121
BindingDB Entry DOI: 10.7270/Q2F76CS6
Sodium channel protein type X alpha subunit
(Mus musculus)
BDBM50329221
(CHEMBL1270899 | N-(3,5-dimethylphenyl)-2-(4-(trifl...)
Show SMILES Cc1cc(C)cc(NC(=O)c2coc(n2)-c2ccc(OC(F)(F)F)cc2)c1
Show InChI InChI=1S/C19H15F3N2O3/c1-11-7-12(2)9-14(8-11)23-17(25)16-10-26-18(24-16)13-3-5-15(6-4-13)27-19(20,21)22/h3-10H,1-2H3,(H,23,25)
n/an/a 1.40E+3n/an/an/an/an/an/a
Abbott Laboratories
Curated by ChEMBL
Assay Description
Inhibition of mouse NaV1.8 by electrophysiology
Bioorg Med Chem Lett 20: 6812-5 (2010)
Article DOI: 10.1016/j.bmcl.2010.08.121
BindingDB Entry DOI: 10.7270/Q2F76CS6
Sodium channel protein type 10 subunit alpha
(Homo sapiens (Human))
BDBM50329221
(CHEMBL1270899 | N-(3,5-dimethylphenyl)-2-(4-(trifl...)
Show SMILES Cc1cc(C)cc(NC(=O)c2coc(n2)-c2ccc(OC(F)(F)F)cc2)c1
Show InChI InChI=1S/C19H15F3N2O3/c1-11-7-12(2)9-14(8-11)23-17(25)16-10-26-18(24-16)13-3-5-15(6-4-13)27-19(20,21)22/h3-10H,1-2H3,(H,23,25)
n/an/a 180n/an/an/an/an/an/a
Abbott Laboratories
Curated by ChEMBL
Assay Description
Inhibition of human NaV1.8 by electrophysiology
Bioorg Med Chem Lett 20: 6812-5 (2010)
Article DOI: 10.1016/j.bmcl.2010.08.121
BindingDB Entry DOI: 10.7270/Q2F76CS6