BDBM50329416 2-(2-Fluoro-phenyl)-5-pyridin-4-yl-1H-pyrrole-3-carboxamide::CHEMBL1270015::US9670191, A2
SMILES: NC(=O)c1cc([nH]c1-c1ccccc1F)-c1ccncc1
InChI Key: InChIKey=MPTYZJWCCYPGET-UHFFFAOYSA-N
Data: 2 IC50
Activity Spreadsheet -- Enzyme Inhibition Constant Data from BindingDB
Found 2 hits for monomerid = 50329416
Trg + Lig
Ki
nM
ΔG°
kcal/mole
IC50
nM
Kd
nM
EC50/IC50
nM
koff
s-1
kon
M-1s-1
pHTemp
°C
Cdc7 Kinase
(Homo sapiens (Human))
BDBM50329416
(2-(2-Fluoro-phenyl)-5-pyridin-4-yl-1H-pyrrole-3-ca...)
Show SMILES NC(=O)c1cc([nH]c1-c1ccccc1F)-c1ccncc1
Show InChI InChI=1S/C16H12FN3O/c17-13-4-2-1-3-11(13)15-12(16(18)21)9-14(20-15)10-5-7-19-8-6-10/h1-9,20H,(H2,18,21)
Reactome pathway
US Patent
n/an/a<100n/an/an/an/an/an/a
NERVIANO MEDICAL SCIENCES S.R.L.
US Patent
Assay Description
The assay consists of the transfer of radioactivity labeled phosphate moiety by the kinase to an acceptor substrate. The resulting 33P-labeled produc...
US Patent US9670191 (2017)
BindingDB Entry DOI: 10.7270/Q2X63K3K
Cell division cycle 7-related protein kinase
(Homo sapiens (Human))
BDBM50329416
(2-(2-Fluoro-phenyl)-5-pyridin-4-yl-1H-pyrrole-3-ca...)
Show SMILES NC(=O)c1cc([nH]c1-c1ccccc1F)-c1ccncc1
Show InChI InChI=1S/C16H12FN3O/c17-13-4-2-1-3-11(13)15-12(16(18)21)9-14(20-15)10-5-7-19-8-6-10/h1-9,20H,(H2,18,21)
Reactome pathway
n/an/a 8n/an/an/an/an/an/a
Nerviano Medical Sciences Srl
Curated by ChEMBL
Assay Description
Inhibition of Cdc7
J Med Chem 53: 7296-315 (2010)
Article DOI: 10.1021/jm100504d
BindingDB Entry DOI: 10.7270/Q24T6JM3