BDBM50329437 5-(2-Amino-pyrimidin-4-yl)-2-phenyl-1H-pyrrole-3-carboxylicAcid Methylamide::CHEMBL1270717::US9670191, M1
SMILES: CNC(=O)c1cc([nH]c1-c1ccccc1)-c1ccnc(N)n1
InChI Key: InChIKey=FKOYPJWDEVSEKO-UHFFFAOYSA-N
Data: 2 IC50
Activity Spreadsheet -- Enzyme Inhibition Constant Data from BindingDB
Found 2 hits for monomerid = 50329437
Trg + Lig
Ki
nM
ΔG°
kcal/mole
IC50
nM
Kd
nM
EC50/IC50
nM
koff
s-1
kon
M-1s-1
pHTemp
°C
Cdc7 Kinase
(Homo sapiens (Human))
BDBM50329437
(5-(2-Amino-pyrimidin-4-yl)-2-phenyl-1H-pyrrole-3-c...)
Show SMILES CNC(=O)c1cc([nH]c1-c1ccccc1)-c1ccnc(N)n1
Show InChI InChI=1S/C16H15N5O/c1-18-15(22)11-9-13(12-7-8-19-16(17)21-12)20-14(11)10-5-3-2-4-6-10/h2-9,20H,1H3,(H,18,22)(H2,17,19,21)
Reactome pathway
US Patent
n/an/a<1.00E+3n/an/an/an/an/an/a
NERVIANO MEDICAL SCIENCES S.R.L.
US Patent
Assay Description
The assay consists of the transfer of radioactivity labeled phosphate moiety by the kinase to an acceptor substrate. The resulting 33P-labeled produc...
US Patent US9670191 (2017)
BindingDB Entry DOI: 10.7270/Q2X63K3K
Cell division cycle 7-related protein kinase
(Homo sapiens (Human))
BDBM50329437
(5-(2-Amino-pyrimidin-4-yl)-2-phenyl-1H-pyrrole-3-c...)
Show SMILES CNC(=O)c1cc([nH]c1-c1ccccc1)-c1ccnc(N)n1
Show InChI InChI=1S/C16H15N5O/c1-18-15(22)11-9-13(12-7-8-19-16(17)21-12)20-14(11)10-5-3-2-4-6-10/h2-9,20H,1H3,(H,18,22)(H2,17,19,21)
Reactome pathway
n/an/a>1n/an/an/an/an/an/a
Nerviano Medical Sciences Srl
Curated by ChEMBL
Assay Description
Inhibition of Cdc7
J Med Chem 53: 7296-315 (2010)
Article DOI: 10.1021/jm100504d
BindingDB Entry DOI: 10.7270/Q24T6JM3