BDBM50329439 4-(3-Carbamoyl-5-pyridin-4-yl-1H-pyrrol-2-yl)-piperidine-1-carboxylic Acid tert-Butyl Ester::CHEMBL1270014::US9670191, Q2
SMILES: CC(C)(C)OC(=O)N1CCC(CC1)c1[nH]c(cc1C(N)=O)-c1ccncc1
InChI Key: InChIKey=WTPBBJLDOYGRJN-UHFFFAOYSA-N
Data: 2 IC50
Activity Spreadsheet -- Enzyme Inhibition Constant Data from BindingDB
Found 2 hits for monomerid = 50329439
Trg + Lig
Ki
nM
ΔG°
kcal/mole
IC50
nM
Kd
nM
EC50/IC50
nM
koff
s-1
kon
M-1s-1
pHTemp
°C
Cell division cycle 7-related protein kinase [58-574]/Protein DBF4 homolog A
(Homo sapiens (Human))
BDBM50329439
(4-(3-Carbamoyl-5-pyridin-4-yl-1H-pyrrol-2-yl)-pipe...)
Show SMILES CC(C)(C)OC(=O)N1CCC(CC1)c1[nH]c(cc1C(N)=O)-c1ccncc1
Show InChI InChI=1S/C20H26N4O3/c1-20(2,3)27-19(26)24-10-6-14(7-11-24)17-15(18(21)25)12-16(23-17)13-4-8-22-9-5-13/h4-5,8-9,12,14,23H,6-7,10-11H2,1-3H3,(H2,21,25)
Reactome pathway
US Patent
n/an/a<1.00E+3n/an/an/an/an/an/a
NERVIANO MEDICAL SCIENCES S.R.L.
US Patent
Assay Description
The assay consists of the transfer of radioactivity labeled phosphate moiety by the kinase to an acceptor substrate. The resulting 33P-labeled produc...
US Patent US9670191 (2017)
BindingDB Entry DOI: 10.7270/Q2X63K3K
Cell division cycle 7-related protein kinase
(Homo sapiens (Human))
BDBM50329439
(4-(3-Carbamoyl-5-pyridin-4-yl-1H-pyrrol-2-yl)-pipe...)
Show SMILES CC(C)(C)OC(=O)N1CCC(CC1)c1[nH]c(cc1C(N)=O)-c1ccncc1
Show InChI InChI=1S/C20H26N4O3/c1-20(2,3)27-19(26)24-10-6-14(7-11-24)17-15(18(21)25)12-16(23-17)13-4-8-22-9-5-13/h4-5,8-9,12,14,23H,6-7,10-11H2,1-3H3,(H2,21,25)
Reactome pathway
n/an/a>1n/an/an/an/an/an/a
Nerviano Medical Sciences Srl
Curated by ChEMBL
Assay Description
Inhibition of Cdc7
J Med Chem 53: 7296-315 (2010)
Article DOI: 10.1021/jm100504d
BindingDB Entry DOI: 10.7270/Q24T6JM3