BDBM50329456 5-(2-Amino-pyridin-4-yl)-2-phenyl-1H-pyrrole-3-carboxamide::CHEMBL1271335
SMILES: NC(=O)c1cc([nH]c1-c1ccccc1)-c1ccnc(N)c1
InChI Key: InChIKey=LYHFNINNXAAWNF-UHFFFAOYSA-N
Data: 1 IC50
Activity Spreadsheet -- Enzyme Inhibition Constant Data from BindingDB
Found 1 hit for monomerid = 50329456
Trg + Lig
Ki
nM
ΔG°
kcal/mole
IC50
nM
Kd
nM
EC50/IC50
nM
koff
s-1
kon
M-1s-1
pHTemp
°C
Cell division cycle 7-related protein kinase
(Homo sapiens (Human))
BDBM50329456
(5-(2-Amino-pyridin-4-yl)-2-phenyl-1H-pyrrole-3-car...)
Show SMILES NC(=O)c1cc([nH]c1-c1ccccc1)-c1ccnc(N)c1
Show InChI InChI=1S/C16H14N4O/c17-14-8-11(6-7-19-14)13-9-12(16(18)21)15(20-13)10-4-2-1-3-5-10/h1-9,20H,(H2,17,19)(H2,18,21)
Reactome pathway
n/an/a 136n/an/an/an/an/an/a
Nerviano Medical Sciences Srl
Curated by ChEMBL
Assay Description
Inhibition of Cdc7
J Med Chem 53: 7296-315 (2010)
Article DOI: 10.1021/jm100504d
BindingDB Entry DOI: 10.7270/Q24T6JM3