BDBM50329464 5-(2-Amino-pyrimidin-4-yl)-2-(1-methyl-1H-indol-2-yl)-1Hpyrrole-3-carboxamide::CHEMBL1270618::US9670191, G14
SMILES: Cn1c(cc2ccccc12)-c1[nH]c(cc1C(N)=O)-c1ccnc(N)n1
InChI Key: InChIKey=IYFKRIWGRGFLBL-UHFFFAOYSA-N
Data: 2 IC50
Activity Spreadsheet -- Enzyme Inhibition Constant Data from BindingDB
Found 2 hits for monomerid = 50329464
Trg + Lig
Ki
nM
ΔG°
kcal/mole
IC50
nM
Kd
nM
EC50/IC50
nM
koff
s-1
kon
M-1s-1
pHTemp
°C
Cdc7 Kinase
(Homo sapiens (Human))
BDBM50329464
(5-(2-Amino-pyrimidin-4-yl)-2-(1-methyl-1H-indol-2-...)
Show SMILES Cn1c(cc2ccccc12)-c1[nH]c(cc1C(N)=O)-c1ccnc(N)n1
Show InChI InChI=1S/C18H16N6O/c1-24-14-5-3-2-4-10(14)8-15(24)16-11(17(19)25)9-13(22-16)12-6-7-21-18(20)23-12/h2-9,22H,1H3,(H2,19,25)(H2,20,21,23)
Reactome pathway
US Patent
n/an/a<1.00E+3n/an/an/an/an/an/a
NERVIANO MEDICAL SCIENCES S.R.L.
US Patent
Assay Description
The assay consists of the transfer of radioactivity labeled phosphate moiety by the kinase to an acceptor substrate. The resulting 33P-labeled produc...
US Patent US9670191 (2017)
BindingDB Entry DOI: 10.7270/Q2X63K3K
Cell division cycle 7-related protein kinase
(Homo sapiens (Human))
BDBM50329464
(5-(2-Amino-pyrimidin-4-yl)-2-(1-methyl-1H-indol-2-...)
Show SMILES Cn1c(cc2ccccc12)-c1[nH]c(cc1C(N)=O)-c1ccnc(N)n1
Show InChI InChI=1S/C18H16N6O/c1-24-14-5-3-2-4-10(14)8-15(24)16-11(17(19)25)9-13(22-16)12-6-7-21-18(20)23-12/h2-9,22H,1H3,(H2,19,25)(H2,20,21,23)
Reactome pathway
n/an/a 9n/an/an/an/an/an/a
Nerviano Medical Sciences Srl
Curated by ChEMBL
Assay Description
Inhibition of Cdc7
J Med Chem 53: 7296-315 (2010)
Article DOI: 10.1021/jm100504d
BindingDB Entry DOI: 10.7270/Q24T6JM3