BDBM50329471 2-(2-Nitro-phenyl)-5-pyridin-4-yl-1H-pyrrole-3-carboxamide::CHEMBL1270425::US9670191, A13
SMILES: NC(=O)c1cc([nH]c1-c1ccccc1[N+]([O-])=O)-c1ccncc1
InChI Key: InChIKey=AQGTUBOJXORWCG-UHFFFAOYSA-N
Data: 2 IC50
Activity Spreadsheet -- Enzyme Inhibition Constant Data from BindingDB
Found 2 hits for monomerid = 50329471
Trg + Lig
Ki
nM
ΔG°
kcal/mole
IC50
nM
Kd
nM
EC50/IC50
nM
koff
s-1
kon
M-1s-1
pHTemp
°C
Cdc7 Kinase
(Homo sapiens (Human))
BDBM50329471
(2-(2-Nitro-phenyl)-5-pyridin-4-yl-1H-pyrrole-3-car...)
Show SMILES NC(=O)c1cc([nH]c1-c1ccccc1[N+]([O-])=O)-c1ccncc1
Show InChI InChI=1S/C16H12N4O3/c17-16(21)12-9-13(10-5-7-18-8-6-10)19-15(12)11-3-1-2-4-14(11)20(22)23/h1-9,19H,(H2,17,21)
Reactome pathway
US Patent
n/an/a<1.00E+3n/an/an/an/an/an/a
NERVIANO MEDICAL SCIENCES S.R.L.
US Patent
Assay Description
The assay consists of the transfer of radioactivity labeled phosphate moiety by the kinase to an acceptor substrate. The resulting 33P-labeled produc...
US Patent US9670191 (2017)
BindingDB Entry DOI: 10.7270/Q2X63K3K
Cell division cycle 7-related protein kinase
(Homo sapiens (Human))
BDBM50329471
(2-(2-Nitro-phenyl)-5-pyridin-4-yl-1H-pyrrole-3-car...)
Show SMILES NC(=O)c1cc([nH]c1-c1ccccc1[N+]([O-])=O)-c1ccncc1
Show InChI InChI=1S/C16H12N4O3/c17-16(21)12-9-13(10-5-7-18-8-6-10)19-15(12)11-3-1-2-4-14(11)20(22)23/h1-9,19H,(H2,17,21)
Reactome pathway
n/an/a 39n/an/an/an/an/an/a
Nerviano Medical Sciences Srl
Curated by ChEMBL
Assay Description
Inhibition of Cdc7
J Med Chem 53: 7296-315 (2010)
Article DOI: 10.1021/jm100504d
BindingDB Entry DOI: 10.7270/Q24T6JM3