BDBM50329537 (R,E)-2-amino-4-(4-(difluoromethoxy)phenyl)-4-(3-(3-methoxyprop-1-enyl)phenyl)-1-methyl-1H-imidazol-5(4H)-one::CHEMBL1270628
SMILES: COC\C=C\c1cccc(c1)[C@]1(N=C(N)N(C)C1=O)c1ccc(OC(F)F)cc1
InChI Key: InChIKey=MXYBHZMUJGWLNJ-KOXUSJRISA-N
Data: 1 IC50  1 EC50
Activity Spreadsheet -- Enzyme Inhibition Constant Data from BindingDB
Found 2 hits for monomerid = 50329537
Trg + Lig
Ki
nM
ΔG°
kcal/mole
IC50
nM
Kd
nM
EC50/IC50
nM
koff
s-1
kon
M-1s-1
pHTemp
°C
Beta-secretase 1
(Homo sapiens (Human))
BDBM50329537
((R,E)-2-amino-4-(4-(difluoromethoxy)phenyl)-4-(3-(...)
Show SMILES COC\C=C\c1cccc(c1)[C@]1(N=C(N)N(C)C1=O)c1ccc(OC(F)F)cc1 |r,t:13|
Show InChI InChI=1S/C21H21F2N3O3/c1-26-18(27)21(25-20(26)24,15-8-10-17(11-9-15)29-19(22)23)16-7-3-5-14(13-16)6-4-12-28-2/h3-11,13,19H,12H2,1-2H3,(H2,24,25)/b6-4+/t21-/m1/s1
n/an/an/an/a 40n/an/an/an/a
Pfizer Inc.
Curated by ChEMBL
Assay Description
Inhibition of human recombinant BACE1 expressed in CHO cells assessed as reduction in amyloid beta level by sandwich ELISA
Bioorg Med Chem Lett 20: 6597-605 (2010)
Article DOI: 10.1016/j.bmcl.2010.09.029
BindingDB Entry DOI: 10.7270/Q2C829JF
Beta-secretase 1
(Homo sapiens (Human))
BDBM50329537
((R,E)-2-amino-4-(4-(difluoromethoxy)phenyl)-4-(3-(...)
Show SMILES COC\C=C\c1cccc(c1)[C@]1(N=C(N)N(C)C1=O)c1ccc(OC(F)F)cc1 |r,t:13|
Show InChI InChI=1S/C21H21F2N3O3/c1-26-18(27)21(25-20(26)24,15-8-10-17(11-9-15)29-19(22)23)16-7-3-5-14(13-16)6-4-12-28-2/h3-11,13,19H,12H2,1-2H3,(H2,24,25)/b6-4+/t21-/m1/s1
n/an/a 20n/an/an/an/an/an/a
Pfizer Inc.
Curated by ChEMBL
Assay Description
Inhibition of human BACE1 by FRET assay
Bioorg Med Chem Lett 20: 6597-605 (2010)
Article DOI: 10.1016/j.bmcl.2010.09.029
BindingDB Entry DOI: 10.7270/Q2C829JF