BDBM50329550 (R)-2-amino-4-(3-(cyclopropylethynyl)phenyl)-4-(4-(difluoromethoxy)phenyl)-1-methyl-1H-imidazol-5(4H)-one::CHEMBL1271246
SMILES: CN1C(N)=N[C@](C1=O)(c1ccc(OC(F)F)cc1)c1cccc(c1)C#CC1CC1
InChI Key: InChIKey=WQGSTVFPWRFZTI-JOCHJYFZSA-N
Data: 5 IC50  1 EC50
Activity Spreadsheet -- Enzyme Inhibition Constant Data from BindingDB
Found 6 hits for monomerid = 50329550
Trg + Lig
Ki
nM
ΔG°
kcal/mole
IC50
nM
Kd
nM
EC50/IC50
nM
koff
s-1
kon
M-1s-1
pHTemp
°C
Beta-secretase 1
(Homo sapiens (Human))
BDBM50329550
((R)-2-amino-4-(3-(cyclopropylethynyl)phenyl)-4-(4-...)
Show SMILES CN1C(N)=N[C@](C1=O)(c1ccc(OC(F)F)cc1)c1cccc(c1)C#CC1CC1 |r,c:3|
Show InChI InChI=1S/C22H19F2N3O2/c1-27-19(28)22(26-21(27)25,16-9-11-18(12-10-16)29-20(23)24)17-4-2-3-15(13-17)8-7-14-5-6-14/h2-4,9-14,20H,5-6H2,1H3,(H2,25,26)/t22-/m1/s1
n/an/an/an/a 100n/an/an/an/a
Pfizer Inc.
Curated by ChEMBL
Assay Description
Inhibition of human recombinant BACE1 expressed in CHO cells assessed as reduction in amyloid beta level by sandwich ELISA
Bioorg Med Chem Lett 20: 6597-605 (2010)
Article DOI: 10.1016/j.bmcl.2010.09.029
BindingDB Entry DOI: 10.7270/Q2C829JF
Beta-secretase 1
(Homo sapiens (Human))
BDBM50329550
((R)-2-amino-4-(3-(cyclopropylethynyl)phenyl)-4-(4-...)
Show SMILES CN1C(N)=N[C@](C1=O)(c1ccc(OC(F)F)cc1)c1cccc(c1)C#CC1CC1 |r,c:3|
Show InChI InChI=1S/C22H19F2N3O2/c1-27-19(28)22(26-21(27)25,16-9-11-18(12-10-16)29-20(23)24)17-4-2-3-15(13-17)8-7-14-5-6-14/h2-4,9-14,20H,5-6H2,1H3,(H2,25,26)/t22-/m1/s1
n/an/a 25n/an/an/an/an/an/a
Pfizer Inc.
Curated by ChEMBL
Assay Description
Inhibition of human BACE1 by FRET assay
Bioorg Med Chem Lett 20: 6597-605 (2010)
Article DOI: 10.1016/j.bmcl.2010.09.029
BindingDB Entry DOI: 10.7270/Q2C829JF
Renin
(Homo sapiens (Human))
BDBM50329550
((R)-2-amino-4-(3-(cyclopropylethynyl)phenyl)-4-(4-...)
Show SMILES CN1C(N)=N[C@](C1=O)(c1ccc(OC(F)F)cc1)c1cccc(c1)C#CC1CC1 |r,c:3|
Show InChI InChI=1S/C22H19F2N3O2/c1-27-19(28)22(26-21(27)25,16-9-11-18(12-10-16)29-20(23)24)17-4-2-3-15(13-17)8-7-14-5-6-14/h2-4,9-14,20H,5-6H2,1H3,(H2,25,26)/t22-/m1/s1
Reactome pathway
n/an/a 7.70E+3n/an/an/an/an/an/a
Pfizer Inc.
Curated by ChEMBL
Assay Description
Inhibition of renin by FRET assay
Bioorg Med Chem Lett 20: 6597-605 (2010)
Article DOI: 10.1016/j.bmcl.2010.09.029
BindingDB Entry DOI: 10.7270/Q2C829JF
Cathepsin D
(Homo sapiens (Human))
BDBM50329550
((R)-2-amino-4-(3-(cyclopropylethynyl)phenyl)-4-(4-...)
Show SMILES CN1C(N)=N[C@](C1=O)(c1ccc(OC(F)F)cc1)c1cccc(c1)C#CC1CC1 |r,c:3|
Show InChI InChI=1S/C22H19F2N3O2/c1-27-19(28)22(26-21(27)25,16-9-11-18(12-10-16)29-20(23)24)17-4-2-3-15(13-17)8-7-14-5-6-14/h2-4,9-14,20H,5-6H2,1H3,(H2,25,26)/t22-/m1/s1
NCI pathway
Reactome pathway
n/an/a 3.75E+3n/an/an/an/an/an/a
Pfizer Inc.
Curated by ChEMBL
Assay Description
Inhibition of cathepsin D by FRET assay
Bioorg Med Chem Lett 20: 6597-605 (2010)
Article DOI: 10.1016/j.bmcl.2010.09.029
BindingDB Entry DOI: 10.7270/Q2C829JF
Cytochrome P450 3A4
(Homo sapiens (Human))
BDBM50329550
((R)-2-amino-4-(3-(cyclopropylethynyl)phenyl)-4-(4-...)
Show SMILES CN1C(N)=N[C@](C1=O)(c1ccc(OC(F)F)cc1)c1cccc(c1)C#CC1CC1 |r,c:3|
Show InChI InChI=1S/C22H19F2N3O2/c1-27-19(28)22(26-21(27)25,16-9-11-18(12-10-16)29-20(23)24)17-4-2-3-15(13-17)8-7-14-5-6-14/h2-4,9-14,20H,5-6H2,1H3,(H2,25,26)/t22-/m1/s1
Reactome pathway
n/an/a 100n/an/an/an/an/an/a
Pfizer Inc.
Curated by ChEMBL
Assay Description
Inhibition of CYP3A4
Bioorg Med Chem Lett 20: 6597-605 (2010)
Article DOI: 10.1016/j.bmcl.2010.09.029
BindingDB Entry DOI: 10.7270/Q2C829JF
Beta-secretase 2
(Homo sapiens (Human))
BDBM50329550
((R)-2-amino-4-(3-(cyclopropylethynyl)phenyl)-4-(4-...)
Show SMILES CN1C(N)=N[C@](C1=O)(c1ccc(OC(F)F)cc1)c1cccc(c1)C#CC1CC1 |r,c:3|
Show InChI InChI=1S/C22H19F2N3O2/c1-27-19(28)22(26-21(27)25,16-9-11-18(12-10-16)29-20(23)24)17-4-2-3-15(13-17)8-7-14-5-6-14/h2-4,9-14,20H,5-6H2,1H3,(H2,25,26)/t22-/m1/s1
n/an/a 70n/an/an/an/an/an/a
Pfizer Inc.
Curated by ChEMBL
Assay Description
Inhibition of BACE2 by FRET assay
Bioorg Med Chem Lett 20: 6597-605 (2010)
Article DOI: 10.1016/j.bmcl.2010.09.029
BindingDB Entry DOI: 10.7270/Q2C829JF