null
SMILES: CN1C(N)=N[C@@](C1=O)(c1cccc(c1)C#CC1CC1)c1ccc(OC(F)F)c(C)c1
InChI Key: InChIKey=PWZLUGHNDYWEDU-QHCPKHFHSA-N
Activity Spreadsheet -- Enzyme Inhibition Constant Data from BindingDB
Found 5 hits for monomerid = 50329573
Trg + Lig
Ki
nM
ΔG°
kcal/mole
IC50
nM
Kd
nM
EC50/IC50
nM
koff
s-1
kon
M-1s-1
pHTemp
°C
Beta-secretase 1
(Homo sapiens (Human))
BDBM50329573
((S)-2-amino-4-(3-(cyclopropylethynyl)phenyl)-4-(4-...)
Show SMILES CN1C(N)=N[C@@](C1=O)(c1cccc(c1)C#CC1CC1)c1ccc(OC(F)F)c(C)c1 |r,c:3|
Show InChI InChI=1S/C23H21F2N3O2/c1-14-12-18(10-11-19(14)30-21(24)25)23(20(29)28(2)22(26)27-23)17-5-3-4-16(13-17)9-8-15-6-7-15/h3-5,10-13,15,21H,6-7H2,1-2H3,(H2,26,27)/t23-/m0/s1
n/an/a 22n/an/an/an/an/an/a
Pfizer Inc.
Curated by ChEMBL
Assay Description
Inhibition of human BACE1 by FRET assay
Bioorg Med Chem Lett 20: 6597-605 (2010)
Article DOI: 10.1016/j.bmcl.2010.09.029
BindingDB Entry DOI: 10.7270/Q2C829JF
Beta-secretase 2
(Homo sapiens (Human))
BDBM50329573
((S)-2-amino-4-(3-(cyclopropylethynyl)phenyl)-4-(4-...)
Show SMILES CN1C(N)=N[C@@](C1=O)(c1cccc(c1)C#CC1CC1)c1ccc(OC(F)F)c(C)c1 |r,c:3|
Show InChI InChI=1S/C23H21F2N3O2/c1-14-12-18(10-11-19(14)30-21(24)25)23(20(29)28(2)22(26)27-23)17-5-3-4-16(13-17)9-8-15-6-7-15/h3-5,10-13,15,21H,6-7H2,1-2H3,(H2,26,27)/t23-/m0/s1
n/an/a 50n/an/an/an/an/an/a
Pfizer Inc.
Curated by ChEMBL
Assay Description
Inhibition of BACE2 by FRET assay
Bioorg Med Chem Lett 20: 6597-605 (2010)
Article DOI: 10.1016/j.bmcl.2010.09.029
BindingDB Entry DOI: 10.7270/Q2C829JF
Renin
(Homo sapiens (Human))
BDBM50329573
((S)-2-amino-4-(3-(cyclopropylethynyl)phenyl)-4-(4-...)
Show SMILES CN1C(N)=N[C@@](C1=O)(c1cccc(c1)C#CC1CC1)c1ccc(OC(F)F)c(C)c1 |r,c:3|
Show InChI InChI=1S/C23H21F2N3O2/c1-14-12-18(10-11-19(14)30-21(24)25)23(20(29)28(2)22(26)27-23)17-5-3-4-16(13-17)9-8-15-6-7-15/h3-5,10-13,15,21H,6-7H2,1-2H3,(H2,26,27)/t23-/m0/s1
Reactome pathway
n/an/a 8.60E+3n/an/an/an/an/an/a
Pfizer Inc.
Curated by ChEMBL
Assay Description
Inhibition of renin by FRET assay
Bioorg Med Chem Lett 20: 6597-605 (2010)
Article DOI: 10.1016/j.bmcl.2010.09.029
BindingDB Entry DOI: 10.7270/Q2C829JF
Cytochrome P450 3A4
(Homo sapiens (Human))
BDBM50329573
((S)-2-amino-4-(3-(cyclopropylethynyl)phenyl)-4-(4-...)
Show SMILES CN1C(N)=N[C@@](C1=O)(c1cccc(c1)C#CC1CC1)c1ccc(OC(F)F)c(C)c1 |r,c:3|
Show InChI InChI=1S/C23H21F2N3O2/c1-14-12-18(10-11-19(14)30-21(24)25)23(20(29)28(2)22(26)27-23)17-5-3-4-16(13-17)9-8-15-6-7-15/h3-5,10-13,15,21H,6-7H2,1-2H3,(H2,26,27)/t23-/m0/s1
Reactome pathway
n/an/a 100n/an/an/an/an/an/a
Pfizer Inc.
Curated by ChEMBL
Assay Description
Inhibition of CYP3A4
Bioorg Med Chem Lett 20: 6597-605 (2010)
Article DOI: 10.1016/j.bmcl.2010.09.029
BindingDB Entry DOI: 10.7270/Q2C829JF
Cathepsin D
(Homo sapiens (Human))
BDBM50329573
((S)-2-amino-4-(3-(cyclopropylethynyl)phenyl)-4-(4-...)
Show SMILES CN1C(N)=N[C@@](C1=O)(c1cccc(c1)C#CC1CC1)c1ccc(OC(F)F)c(C)c1 |r,c:3|
Show InChI InChI=1S/C23H21F2N3O2/c1-14-12-18(10-11-19(14)30-21(24)25)23(20(29)28(2)22(26)27-23)17-5-3-4-16(13-17)9-8-15-6-7-15/h3-5,10-13,15,21H,6-7H2,1-2H3,(H2,26,27)/t23-/m0/s1
NCI pathway
Reactome pathway
n/an/a 2.00E+3n/an/an/an/an/an/a
Pfizer Inc.
Curated by ChEMBL
Assay Description
Inhibition of cathepsin D by FRET assay
Bioorg Med Chem Lett 20: 6597-605 (2010)
Article DOI: 10.1016/j.bmcl.2010.09.029
BindingDB Entry DOI: 10.7270/Q2C829JF