BDBM50329612 6-ethyl-5-(3-(5-methoxybiphenyl-3-yl)prop-1-ynyl)pyrimidine-2,4-diamine::CHEMBL1270633
SMILES: CCc1nc(N)nc(N)c1C#CCc1cc(OC)cc(c1)-c1ccccc1
InChI Key: InChIKey=QKLZHVMWTSBUFL-UHFFFAOYSA-N
Data: 1 KI  4 IC50
PDB links: 1 PDB ID matches this monomer.
Activity Spreadsheet -- Enzyme Inhibition Constant Data from BindingDB
Found 5 hits for monomerid = 50329612
Trg + Lig
Ki
nM
ΔG°
kcal/mole
IC50
nM
Kd
nM
EC50/IC50
nM
koff
s-1
kon
M-1s-1
pHTemp
°C
Dihydrofolate Reductase (DHFR)
(Bacillus anthracis)
BDBM50329612
(6-ethyl-5-(3-(5-methoxybiphenyl-3-yl)prop-1-ynyl)p...)
Show SMILES CCc1nc(N)nc(N)c1C#CCc1cc(OC)cc(c1)-c1ccccc1
Show InChI InChI=1S/C22H22N4O/c1-3-20-19(21(23)26-22(24)25-20)11-7-8-15-12-17(14-18(13-15)27-2)16-9-5-4-6-10-16/h4-6,9-10,12-14H,3,8H2,1-2H3,(H4,23,24,25,26)
330n/an/an/an/an/an/an/an/a
University of Connecticut
Curated by ChEMBL
Assay Description
Inhibition of wild type Bacillus anthracis recombinant DHFR
J Med Chem 53: 7327-36 (2010)
Article DOI: 10.1021/jm100727t
BindingDB Entry DOI: 10.7270/Q2028RSR
3D
3D Structure (crystal)
Dihydrofolate reductase (DHFR)
(Streptococcus pyogenes)
BDBM50329612
(6-ethyl-5-(3-(5-methoxybiphenyl-3-yl)prop-1-ynyl)p...)
Show SMILES CCc1nc(N)nc(N)c1C#CCc1cc(OC)cc(c1)-c1ccccc1
Show InChI InChI=1S/C22H22N4O/c1-3-20-19(21(23)26-22(24)25-20)11-7-8-15-12-17(14-18(13-15)27-2)16-9-5-4-6-10-16/h4-6,9-10,12-14H,3,8H2,1-2H3,(H4,23,24,25,26)
US Patent
n/an/a 52n/an/an/an/an/an/a
University of Connecticut
US Patent
Assay Description
Heterocyclic analogs of propargyl-linked inhibitors of the third generation analogs were evaluated in enzyme inhibition assays, assessed for S. aur...
US Patent US8853228 (2014)
BindingDB Entry DOI: 10.7270/Q2TD9W1T
Dihydrofolate Reductase (DHFR)
(Bacillus anthracis)
BDBM50329612
(6-ethyl-5-(3-(5-methoxybiphenyl-3-yl)prop-1-ynyl)p...)
Show SMILES CCc1nc(N)nc(N)c1C#CCc1cc(OC)cc(c1)-c1ccccc1
Show InChI InChI=1S/C22H22N4O/c1-3-20-19(21(23)26-22(24)25-20)11-7-8-15-12-17(14-18(13-15)27-2)16-9-5-4-6-10-16/h4-6,9-10,12-14H,3,8H2,1-2H3,(H4,23,24,25,26)
n/an/a 973n/an/an/an/an/an/a
University of Connecticut
Curated by ChEMBL
Assay Description
Inhibition of wild type Bacillus anthracis recombinant DHFR
J Med Chem 53: 7327-36 (2010)
Article DOI: 10.1021/jm100727t
BindingDB Entry DOI: 10.7270/Q2028RSR
3D
3D Structure (crystal)
Dihydrofolate Reductase (DHFR)
(Staphylococcus aureus)
BDBM50329612
(6-ethyl-5-(3-(5-methoxybiphenyl-3-yl)prop-1-ynyl)p...)
Show SMILES CCc1nc(N)nc(N)c1C#CCc1cc(OC)cc(c1)-c1ccccc1
Show InChI InChI=1S/C22H22N4O/c1-3-20-19(21(23)26-22(24)25-20)11-7-8-15-12-17(14-18(13-15)27-2)16-9-5-4-6-10-16/h4-6,9-10,12-14H,3,8H2,1-2H3,(H4,23,24,25,26)
US Patent
n/an/a 59n/an/an/an/an/an/a
University of Connecticut
US Patent
Assay Description
Heterocyclic analogs of propargyl-linked inhibitors of the third generation analogs were evaluated in enzyme inhibition assays, assessed for S. aur...
US Patent US8853228 (2014)
BindingDB Entry DOI: 10.7270/Q2TD9W1T
Dihydrofolate reductase
(Homo sapiens (Human))
BDBM50329612
(6-ethyl-5-(3-(5-methoxybiphenyl-3-yl)prop-1-ynyl)p...)
Show SMILES CCc1nc(N)nc(N)c1C#CCc1cc(OC)cc(c1)-c1ccccc1
Show InChI InChI=1S/C22H22N4O/c1-3-20-19(21(23)26-22(24)25-20)11-7-8-15-12-17(14-18(13-15)27-2)16-9-5-4-6-10-16/h4-6,9-10,12-14H,3,8H2,1-2H3,(H4,23,24,25,26)
NCI pathway
Reactome pathway
US Patent
n/an/a 140n/an/an/an/an/an/a
University of Connecticut
US Patent
Assay Description
Heterocyclic analogs of propargyl-linked inhibitors of the third generation analogs were evaluated in enzyme inhibition assays, assessed for S. aur...
US Patent US8853228 (2014)
BindingDB Entry DOI: 10.7270/Q2TD9W1T