BDBM50329722 CHEMBL1271519::endo-N-((1R,5R)-9-methyl-9-azabicyclo[3.3.1]nonan-3-yl)-2-morpholinobenzo[d]oxazole-4-carboxamide
SMILES: CN1[C@@H]2CCC[C@@H]1CC(C2)NC(=O)c1cccc2oc(nc12)N1CCOCC1
InChI Key: InChIKey=RXDWERDONCYTQT-HZPDHXFCSA-N
Data: 1 KI  2 IC50
Activity Spreadsheet -- Enzyme Inhibition Constant Data from BindingDB
Found 3 hits for monomerid = 50329722
Trg + Lig
Ki
nM
ΔG°
kcal/mole
IC50
nM
Kd
nM
EC50/IC50
nM
koff
s-1
kon
M-1s-1
pHTemp
°C
5-hydroxytryptamine receptor 3A
(Homo sapiens (Human))
BDBM50329722
(CHEMBL1271519 | endo-N-((1R,5R)-9-methyl-9-azabicy...)
Show SMILES CN1[C@@H]2CCC[C@@H]1CC(C2)NC(=O)c1cccc2oc(nc12)N1CCOCC1 |r,TLB:0:1:3.4.5:7.8.9|
Show InChI InChI=1S/C21H28N4O3/c1-24-15-4-2-5-16(24)13-14(12-15)22-20(26)17-6-3-7-18-19(17)23-21(28-18)25-8-10-27-11-9-25/h3,6-7,14-16H,2,4-5,8-13H2,1H3,(H,22,26)/t15-,16-/m1/s1
Reactome pathway
40n/an/an/an/an/an/an/an/a
AMRI
Curated by ChEMBL
Assay Description
Binding affinity to human HT3A receptor
Bioorg Med Chem Lett 20: 6538-41 (2010)
Article DOI: 10.1016/j.bmcl.2010.09.038
BindingDB Entry DOI: 10.7270/Q2Z31ZVH
Cytochrome P450 3A4
(Homo sapiens (Human))
BDBM50329722
(CHEMBL1271519 | endo-N-((1R,5R)-9-methyl-9-azabicy...)
Show SMILES CN1[C@@H]2CCC[C@@H]1CC(C2)NC(=O)c1cccc2oc(nc12)N1CCOCC1 |r,TLB:0:1:3.4.5:7.8.9|
Show InChI InChI=1S/C21H28N4O3/c1-24-15-4-2-5-16(24)13-14(12-15)22-20(26)17-6-3-7-18-19(17)23-21(28-18)25-8-10-27-11-9-25/h3,6-7,14-16H,2,4-5,8-13H2,1H3,(H,22,26)/t15-,16-/m1/s1
Reactome pathway
n/an/a>5.00E+4n/an/an/an/an/an/a
AMRI
Curated by ChEMBL
Assay Description
Inhibition of human CYP3A4
Bioorg Med Chem Lett 20: 6538-41 (2010)
Article DOI: 10.1016/j.bmcl.2010.09.038
BindingDB Entry DOI: 10.7270/Q2Z31ZVH
Potassium voltage-gated channel subfamily H member 2
(Homo sapiens (Human))
BDBM50329722
(CHEMBL1271519 | endo-N-((1R,5R)-9-methyl-9-azabicy...)
Show SMILES CN1[C@@H]2CCC[C@@H]1CC(C2)NC(=O)c1cccc2oc(nc12)N1CCOCC1 |r,TLB:0:1:3.4.5:7.8.9|
Show InChI InChI=1S/C21H28N4O3/c1-24-15-4-2-5-16(24)13-14(12-15)22-20(26)17-6-3-7-18-19(17)23-21(28-18)25-8-10-27-11-9-25/h3,6-7,14-16H,2,4-5,8-13H2,1H3,(H,22,26)/t15-,16-/m1/s1
Reactome pathway
n/an/a 1.40E+3n/an/an/an/an/an/a
AMRI
Curated by ChEMBL
Assay Description
Inhibition of human ERG expressed in HEK cells by patch clamp technique
Bioorg Med Chem Lett 20: 6538-41 (2010)
Article DOI: 10.1016/j.bmcl.2010.09.038
BindingDB Entry DOI: 10.7270/Q2Z31ZVH