BDBM50329792 (Z)-3-((4-(N-(2-(dimethylamino)ethyl)methylsulfonamido)phenylamino)(phenyl)methylene)-N-ethyl-N-methyl-2-oxoindoline-6-carboxamide::CHEMBL1272182
SMILES: CCN(C)C(=O)c1ccc2C(C(=Nc3ccc(cc3)N(CCN(C)C)S(C)(=O)=O)c3ccccc3)C(=O)Nc2c1
InChI Key: InChIKey=PRGJXCHZTFKJNC-UHFFFAOYSA-N
Data: 2 IC50  1 EC50
Activity Spreadsheet -- Enzyme Inhibition Constant Data from BindingDB
Found 3 hits for monomerid = 50329792
Trg + Lig
Ki
nM
ΔG°
kcal/mole
IC50
nM
Kd
nM
EC50/IC50
nM
koff
s-1
kon
M-1s-1
pHTemp
°C
TGF-beta receptor type-1
(Homo sapiens (Human))
BDBM50329792
((Z)-3-((4-(N-(2-(dimethylamino)ethyl)methylsulfona...)
Show SMILES CCN(C)C(=O)c1ccc2C(C(=Nc3ccc(cc3)N(CCN(C)C)S(C)(=O)=O)c3ccccc3)C(=O)Nc2c1 |w:12.12|
Show InChI InChI=1S/C30H35N5O4S/c1-6-34(4)30(37)22-12-17-25-26(20-22)32-29(36)27(25)28(21-10-8-7-9-11-21)31-23-13-15-24(16-14-23)35(40(5,38)39)19-18-33(2)3/h7-17,20,27H,6,18-19H2,1-5H3,(H,32,36)
n/an/an/an/a 209n/an/an/an/a
Boehringer Ingelheim Pharma GmbH& Co KG
Curated by ChEMBL
Assay Description
Inhibition of TGFbeta receptor in human HaCaT cells assessed as Smad phosphorylation by ELISA
J Med Chem 53: 7287-95 (2010)
Article DOI: 10.1021/jm100812a
BindingDB Entry DOI: 10.7270/Q2F47PCW
Platelet-derived growth factor receptor alpha
(Homo sapiens (Human))
BDBM50329792
((Z)-3-((4-(N-(2-(dimethylamino)ethyl)methylsulfona...)
Show SMILES CCN(C)C(=O)c1ccc2C(C(=Nc3ccc(cc3)N(CCN(C)C)S(C)(=O)=O)c3ccccc3)C(=O)Nc2c1 |w:12.12|
Show InChI InChI=1S/C30H35N5O4S/c1-6-34(4)30(37)22-12-17-25-26(20-22)32-29(36)27(25)28(21-10-8-7-9-11-21)31-23-13-15-24(16-14-23)35(40(5,38)39)19-18-33(2)3/h7-17,20,27H,6,18-19H2,1-5H3,(H,32,36)
n/an/a 155n/an/an/an/an/an/a
Boehringer Ingelheim Pharma GmbH& Co KG
Curated by ChEMBL
Assay Description
Inhibition of PDGFRalpha
J Med Chem 53: 7287-95 (2010)
Article DOI: 10.1021/jm100812a
BindingDB Entry DOI: 10.7270/Q2F47PCW
TGF-beta receptor type-1
(Homo sapiens (Human))
BDBM50329792
((Z)-3-((4-(N-(2-(dimethylamino)ethyl)methylsulfona...)
Show SMILES CCN(C)C(=O)c1ccc2C(C(=Nc3ccc(cc3)N(CCN(C)C)S(C)(=O)=O)c3ccccc3)C(=O)Nc2c1 |w:12.12|
Show InChI InChI=1S/C30H35N5O4S/c1-6-34(4)30(37)22-12-17-25-26(20-22)32-29(36)27(25)28(21-10-8-7-9-11-21)31-23-13-15-24(16-14-23)35(40(5,38)39)19-18-33(2)3/h7-17,20,27H,6,18-19H2,1-5H3,(H,32,36)
n/an/a 7n/an/an/an/an/an/a
Boehringer Ingelheim Pharma GmbH& Co KG
Curated by ChEMBL
Assay Description
Inhibition of TGFbeta receptor
J Med Chem 53: 7287-95 (2010)
Article DOI: 10.1021/jm100812a
BindingDB Entry DOI: 10.7270/Q2F47PCW