BDBM50329794 (Z)-3-((4-(N-(2-(dimethylamino)ethyl)acetamido)phenylamino)(phenyl)methylene)-N-ethyl-N-methyl-2-oxoindoline-6-carboxamide::CHEMBL1272291
SMILES: CCN(C)C(=O)c1ccc2C(C(=Nc3ccc(cc3)N(CCN(C)C)C(C)=O)c3ccccc3)C(=O)Nc2c1
InChI Key: InChIKey=ZUUYXUJYVRIKRA-UHFFFAOYSA-N
Data: 2 IC50  1 EC50
Activity Spreadsheet -- Enzyme Inhibition Constant Data from BindingDB
Found 3 hits for monomerid = 50329794
Trg + Lig
Ki
nM
ΔG°
kcal/mole
IC50
nM
Kd
nM
EC50/IC50
nM
koff
s-1
kon
M-1s-1
pHTemp
°C
TGF-beta receptor type-1
(Homo sapiens (Human))
BDBM50329794
((Z)-3-((4-(N-(2-(dimethylamino)ethyl)acetamido)phe...)
Show SMILES CCN(C)C(=O)c1ccc2C(C(=Nc3ccc(cc3)N(CCN(C)C)C(C)=O)c3ccccc3)C(=O)Nc2c1 |w:12.12|
Show InChI InChI=1S/C31H35N5O3/c1-6-35(5)31(39)23-12-17-26-27(20-23)33-30(38)28(26)29(22-10-8-7-9-11-22)32-24-13-15-25(16-14-24)36(21(2)37)19-18-34(3)4/h7-17,20,28H,6,18-19H2,1-5H3,(H,33,38)
n/an/an/an/a 102n/an/an/an/a
Boehringer Ingelheim Pharma GmbH& Co KG
Curated by ChEMBL
Assay Description
Inhibition of TGFbeta receptor in human HaCaT cells assessed as Smad phosphorylation by ELISA
J Med Chem 53: 7287-95 (2010)
Article DOI: 10.1021/jm100812a
BindingDB Entry DOI: 10.7270/Q2F47PCW
Platelet-derived growth factor receptor alpha
(Homo sapiens (Human))
BDBM50329794
((Z)-3-((4-(N-(2-(dimethylamino)ethyl)acetamido)phe...)
Show SMILES CCN(C)C(=O)c1ccc2C(C(=Nc3ccc(cc3)N(CCN(C)C)C(C)=O)c3ccccc3)C(=O)Nc2c1 |w:12.12|
Show InChI InChI=1S/C31H35N5O3/c1-6-35(5)31(39)23-12-17-26-27(20-23)33-30(38)28(26)29(22-10-8-7-9-11-22)32-24-13-15-25(16-14-24)36(21(2)37)19-18-34(3)4/h7-17,20,28H,6,18-19H2,1-5H3,(H,33,38)
n/an/a 160n/an/an/an/an/an/a
Boehringer Ingelheim Pharma GmbH& Co KG
Curated by ChEMBL
Assay Description
Inhibition of PDGFRalpha
J Med Chem 53: 7287-95 (2010)
Article DOI: 10.1021/jm100812a
BindingDB Entry DOI: 10.7270/Q2F47PCW
TGF-beta receptor type-1
(Homo sapiens (Human))
BDBM50329794
((Z)-3-((4-(N-(2-(dimethylamino)ethyl)acetamido)phe...)
Show SMILES CCN(C)C(=O)c1ccc2C(C(=Nc3ccc(cc3)N(CCN(C)C)C(C)=O)c3ccccc3)C(=O)Nc2c1 |w:12.12|
Show InChI InChI=1S/C31H35N5O3/c1-6-35(5)31(39)23-12-17-26-27(20-23)33-30(38)28(26)29(22-10-8-7-9-11-22)32-24-13-15-25(16-14-24)36(21(2)37)19-18-34(3)4/h7-17,20,28H,6,18-19H2,1-5H3,(H,33,38)
n/an/a 8n/an/an/an/an/an/a
Boehringer Ingelheim Pharma GmbH& Co KG
Curated by ChEMBL
Assay Description
Inhibition of TGFbeta receptor
J Med Chem 53: 7287-95 (2010)
Article DOI: 10.1021/jm100812a
BindingDB Entry DOI: 10.7270/Q2F47PCW