BDBM50329799 (Z)-3-((4-((dimethylamino)methyl)phenylamino)(phenyl)methylene)-N-ethyl-2-oxoindoline-6-carboxamide::CHEMBL1272289
SMILES: CCNC(=O)c1ccc2C(C(=Nc3ccc(CN(C)C)cc3)c3ccccc3)C(=O)Nc2c1
InChI Key: InChIKey=FKBBYKXWULFABH-UHFFFAOYSA-N
Data: 2 IC50  1 EC50
Activity Spreadsheet -- Enzyme Inhibition Constant Data from BindingDB
Found 3 hits for monomerid = 50329799
Trg + Lig
Ki
nM
ΔG°
kcal/mole
IC50
nM
Kd
nM
EC50/IC50
nM
koff
s-1
kon
M-1s-1
pHTemp
°C
TGF-beta receptor type-1
(Homo sapiens (Human))
BDBM50329799
((Z)-3-((4-((dimethylamino)methyl)phenylamino)(phen...)
Show SMILES CCNC(=O)c1ccc2C(C(=Nc3ccc(CN(C)C)cc3)c3ccccc3)C(=O)Nc2c1 |w:11.11|
Show InChI InChI=1S/C27H28N4O2/c1-4-28-26(32)20-12-15-22-23(16-20)30-27(33)24(22)25(19-8-6-5-7-9-19)29-21-13-10-18(11-14-21)17-31(2)3/h5-16,24H,4,17H2,1-3H3,(H,28,32)(H,30,33)
n/an/an/an/a 185n/an/an/an/a
Boehringer Ingelheim Pharma GmbH& Co KG
Curated by ChEMBL
Assay Description
Inhibition of TGFbeta receptor in human HaCaT cells assessed as Smad phosphorylation by ELISA
J Med Chem 53: 7287-95 (2010)
Article DOI: 10.1021/jm100812a
BindingDB Entry DOI: 10.7270/Q2F47PCW
Platelet-derived growth factor receptor alpha
(Homo sapiens (Human))
BDBM50329799
((Z)-3-((4-((dimethylamino)methyl)phenylamino)(phen...)
Show SMILES CCNC(=O)c1ccc2C(C(=Nc3ccc(CN(C)C)cc3)c3ccccc3)C(=O)Nc2c1 |w:11.11|
Show InChI InChI=1S/C27H28N4O2/c1-4-28-26(32)20-12-15-22-23(16-20)30-27(33)24(22)25(19-8-6-5-7-9-19)29-21-13-10-18(11-14-21)17-31(2)3/h5-16,24H,4,17H2,1-3H3,(H,28,32)(H,30,33)
n/an/a 99n/an/an/an/an/an/a
Boehringer Ingelheim Pharma GmbH& Co KG
Curated by ChEMBL
Assay Description
Inhibition of PDGFRalpha
J Med Chem 53: 7287-95 (2010)
Article DOI: 10.1021/jm100812a
BindingDB Entry DOI: 10.7270/Q2F47PCW
TGF-beta receptor type-1
(Homo sapiens (Human))
BDBM50329799
((Z)-3-((4-((dimethylamino)methyl)phenylamino)(phen...)
Show SMILES CCNC(=O)c1ccc2C(C(=Nc3ccc(CN(C)C)cc3)c3ccccc3)C(=O)Nc2c1 |w:11.11|
Show InChI InChI=1S/C27H28N4O2/c1-4-28-26(32)20-12-15-22-23(16-20)30-27(33)24(22)25(19-8-6-5-7-9-19)29-21-13-10-18(11-14-21)17-31(2)3/h5-16,24H,4,17H2,1-3H3,(H,28,32)(H,30,33)
n/an/a 19n/an/an/an/an/an/a
Boehringer Ingelheim Pharma GmbH& Co KG
Curated by ChEMBL
Assay Description
Inhibition of TGFbeta receptor
J Med Chem 53: 7287-95 (2010)
Article DOI: 10.1021/jm100812a
BindingDB Entry DOI: 10.7270/Q2F47PCW