BDBM50329836 2-Chloro-5-[(1H-imidazo[4,5-c]quinolin-2-ylsulfanyl)acetyl]benzenesulfonamide::CHEMBL1271639
SMILES: NS(=O)(=O)c1cc(ccc1Cl)C(=O)CSc1nc2c(cnc3ccccc23)[nH]1
InChI Key: InChIKey=APUFNRAMLCSAKF-UHFFFAOYSA-N
Data: 4 Kd
Activity Spreadsheet -- Enzyme Inhibition Constant Data from BindingDB
Found 4 hits for monomerid = 50329836
Trg + Lig
Ki
nM
ΔG°
kcal/mole
IC50
nM
Kd
nM
EC50/IC50
nM
koff
s-1
kon
M-1s-1
pHTemp
°C
Carbonic anhydrase 1
(Homo sapiens (Human))
BDBM50329836
(2-Chloro-5-[(1H-imidazo[4,5-c]quinolin-2-ylsulfany...)
Show SMILES NS(=O)(=O)c1cc(ccc1Cl)C(=O)CSc1nc2c(cnc3ccccc23)[nH]1
Show InChI InChI=1S/C18H13ClN4O3S2/c19-12-6-5-10(7-16(12)28(20,25)26)15(24)9-27-18-22-14-8-21-13-4-2-1-3-11(13)17(14)23-18/h1-8H,9H2,(H,22,23)(H2,20,25,26)
NCI pathway
Reactome pathway
n/an/an/a 1.30E+3n/an/an/an/an/a
Institute of Biotechnology
Curated by ChEMBL
Assay Description
Binding affinity to human recombinant carbonic anhydrase 1 by thermal shift assay
Bioorg Med Chem 18: 7357-64 (2010)
Article DOI: 10.1016/j.bmc.2010.09.016
BindingDB Entry DOI: 10.7270/Q21V5F6H
Carbonic anhydrase 13 (CA XIII)
(Homo sapiens (Human))
BDBM50329836
(2-Chloro-5-[(1H-imidazo[4,5-c]quinolin-2-ylsulfany...)
Show SMILES NS(=O)(=O)c1cc(ccc1Cl)C(=O)CSc1nc2c(cnc3ccccc23)[nH]1
Show InChI InChI=1S/C18H13ClN4O3S2/c19-12-6-5-10(7-16(12)28(20,25)26)15(24)9-27-18-22-14-8-21-13-4-2-1-3-11(13)17(14)23-18/h1-8H,9H2,(H,22,23)(H2,20,25,26)
n/an/an/a 100n/an/an/an/an/a
Institute of Biotechnology
Curated by ChEMBL
Assay Description
Binding affinity to human recombinant carbonic anhydrase 13 by thermal shift assay
Bioorg Med Chem 18: 7357-64 (2010)
Article DOI: 10.1016/j.bmc.2010.09.016
BindingDB Entry DOI: 10.7270/Q21V5F6H
Carbonic anhydrase 7
(Homo sapiens (Human))
BDBM50329836
(2-Chloro-5-[(1H-imidazo[4,5-c]quinolin-2-ylsulfany...)
Show SMILES NS(=O)(=O)c1cc(ccc1Cl)C(=O)CSc1nc2c(cnc3ccccc23)[nH]1
Show InChI InChI=1S/C18H13ClN4O3S2/c19-12-6-5-10(7-16(12)28(20,25)26)15(24)9-27-18-22-14-8-21-13-4-2-1-3-11(13)17(14)23-18/h1-8H,9H2,(H,22,23)(H2,20,25,26)
Reactome pathway
n/an/an/a 100n/an/an/an/an/a
Institute of Biotechnology
Curated by ChEMBL
Assay Description
Binding affinity to human recombinant carbonic anhydrase 7 by thermal shift assay
Bioorg Med Chem 18: 7357-64 (2010)
Article DOI: 10.1016/j.bmc.2010.09.016
BindingDB Entry DOI: 10.7270/Q21V5F6H
Carbonic anhydrase 2
(Homo sapiens (Human))
BDBM50329836
(2-Chloro-5-[(1H-imidazo[4,5-c]quinolin-2-ylsulfany...)
Show SMILES NS(=O)(=O)c1cc(ccc1Cl)C(=O)CSc1nc2c(cnc3ccccc23)[nH]1
Show InChI InChI=1S/C18H13ClN4O3S2/c19-12-6-5-10(7-16(12)28(20,25)26)15(24)9-27-18-22-14-8-21-13-4-2-1-3-11(13)17(14)23-18/h1-8H,9H2,(H,22,23)(H2,20,25,26)
Reactome pathway
n/an/an/a 30n/an/an/an/an/a
Institute of Biotechnology
Curated by ChEMBL
Assay Description
Binding affinity to human recombinant carbonic anhydrase 2 by thermal shift assay
Bioorg Med Chem 18: 7357-64 (2010)
Article DOI: 10.1016/j.bmc.2010.09.016
BindingDB Entry DOI: 10.7270/Q21V5F6H
3D
3D Structure (docked)