BDBM50329898 2-chloro-N-(6-(4-chloro-6-(trifluoromethyl)pyrimidin-2-yl)pyridin-3-yl)acetamide::CHEMBL1272037
SMILES: FC(F)(F)c1cc(Cl)nc(n1)-c1ccc(NC(=O)CCl)cn1
InChI Key: InChIKey=RGHCKPXBEZDOJH-UHFFFAOYSA-N
Data: 2 IC50
Activity Spreadsheet -- Enzyme Inhibition Constant Data from BindingDB
Found 2 hits for monomerid = 50329898
Trg + Lig
Ki
nM
ΔG°
kcal/mole
IC50
nM
Kd
nM
EC50/IC50
nM
koff
s-1
kon
M-1s-1
pHTemp
°C
Hypoxia-inducible factor 1-alpha
(Homo sapiens (Human))
BDBM50329898
(2-chloro-N-(6-(4-chloro-6-(trifluoromethyl)pyrimid...)
Show SMILES FC(F)(F)c1cc(Cl)nc(n1)-c1ccc(NC(=O)CCl)cn1
Show InChI InChI=1S/C12H7Cl2F3N4O/c13-4-10(22)19-6-1-2-7(18-5-6)11-20-8(12(15,16)17)3-9(14)21-11/h1-3,5H,4H2,(H,19,22)
Reactome pathway
n/an/a 1.40E+3n/an/an/an/an/an/a
Piramal Life Sciences
Curated by ChEMBL
Assay Description
Inhibition of HIF1alpha in human U251 cells under hypoxic condition by luciferase reporter gene assay
Bioorg Med Chem Lett 20: 6426-9 (2010)
Article DOI: 10.1016/j.bmcl.2010.09.083
BindingDB Entry DOI: 10.7270/Q2HX1CXM
Hypoxia-inducible factor 1-alpha
(Homo sapiens (Human))
BDBM50329898
(2-chloro-N-(6-(4-chloro-6-(trifluoromethyl)pyrimid...)
Show SMILES FC(F)(F)c1cc(Cl)nc(n1)-c1ccc(NC(=O)CCl)cn1
Show InChI InChI=1S/C12H7Cl2F3N4O/c13-4-10(22)19-6-1-2-7(18-5-6)11-20-8(12(15,16)17)3-9(14)21-11/h1-3,5H,4H2,(H,19,22)
Reactome pathway
n/an/a 1.00E+4n/an/an/an/an/an/a
Piramal Life Sciences
Curated by ChEMBL
Assay Description
Inhibition of HIF1alpha in human U251 cells under normoxic condition by luciferase reporter gene assay
Bioorg Med Chem Lett 20: 6426-9 (2010)
Article DOI: 10.1016/j.bmcl.2010.09.083
BindingDB Entry DOI: 10.7270/Q2HX1CXM