BDBM50329913 1-(2-fluoroethyl)-8-(5-(piperazin-1-yl)-2-(trifluoromethoxy)phenylamino)-4,5-dihydro-1H-pyrazolo[4,3-h]quinazoline-3-carboxamide::CHEMBL1271751
SMILES: CN1CCN(CC1)c1ccc(OC(F)(F)F)c(Nc2ncc3CCc4c(nn(CCF)c4-c3n2)C(N)=O)c1
InChI Key: InChIKey=VPWDLLHGBJTELF-UHFFFAOYSA-N
Data: 8 IC50
Activity Spreadsheet -- Enzyme Inhibition Constant Data from BindingDB
Found 8 hits for monomerid = 50329913
Trg + Lig
Ki
nM
ΔG°
kcal/mole
IC50
nM
Kd
nM
EC50/IC50
nM
koff
s-1
kon
M-1s-1
pHTemp
°C
Serine/threonine-protein kinase PLK1
(Homo sapiens (Human))
BDBM50329913
(1-(2-fluoroethyl)-8-(5-(piperazin-1-yl)-2-(trifluo...)
Show SMILES CN1CCN(CC1)c1ccc(OC(F)(F)F)c(Nc2ncc3CCc4c(nn(CCF)c4-c3n2)C(N)=O)c1
Show InChI InChI=1S/C24H26F4N8O2/c1-34-8-10-35(11-9-34)15-3-5-18(38-24(26,27)28)17(12-15)31-23-30-13-14-2-4-16-20(22(29)37)33-36(7-6-25)21(16)19(14)32-23/h3,5,12-13H,2,4,6-11H2,1H3,(H2,29,37)(H,30,31,32)
NCI pathway
Reactome pathway
US Patent
n/an/a 5n/an/an/an/a7.9n/a
Nerviano Medical Sciences S.r.l.
US Patent
Assay Description
The inhibitory activity of putative kinase inhibitors and the potency of selected compounds were determined using a trans-phosphorylation assay.Speci...
US Patent US8614220 (2013)
BindingDB Entry DOI: 10.7270/Q23J3BNV
Serine/threonine-protein kinase PLK2
(Homo sapiens (Human))
BDBM50329913
(1-(2-fluoroethyl)-8-(5-(piperazin-1-yl)-2-(trifluo...)
Show SMILES CN1CCN(CC1)c1ccc(OC(F)(F)F)c(Nc2ncc3CCc4c(nn(CCF)c4-c3n2)C(N)=O)c1
Show InChI InChI=1S/C24H26F4N8O2/c1-34-8-10-35(11-9-34)15-3-5-18(38-24(26,27)28)17(12-15)31-23-30-13-14-2-4-16-20(22(29)37)33-36(7-6-25)21(16)19(14)32-23/h3,5,12-13H,2,4,6-11H2,1H3,(H2,29,37)(H,30,31,32)
NCI pathway
n/an/a>1.00E+4n/an/an/an/an/an/a
Nerviano Medical Sciences srl
Curated by ChEMBL
Assay Description
Inhibition of PLK2
Bioorg Med Chem Lett 20: 6489-94 (2010)
Article DOI: 10.1016/j.bmcl.2010.09.060
BindingDB Entry DOI: 10.7270/Q2VT1T39
Serine/threonine-protein kinase PLK3
(Homo sapiens (Human))
BDBM50329913
(1-(2-fluoroethyl)-8-(5-(piperazin-1-yl)-2-(trifluo...)
Show SMILES CN1CCN(CC1)c1ccc(OC(F)(F)F)c(Nc2ncc3CCc4c(nn(CCF)c4-c3n2)C(N)=O)c1
Show InChI InChI=1S/C24H26F4N8O2/c1-34-8-10-35(11-9-34)15-3-5-18(38-24(26,27)28)17(12-15)31-23-30-13-14-2-4-16-20(22(29)37)33-36(7-6-25)21(16)19(14)32-23/h3,5,12-13H,2,4,6-11H2,1H3,(H2,29,37)(H,30,31,32)
NCI pathway
n/an/a>1.00E+4n/an/an/an/an/an/a
Nerviano Medical Sciences srl
Curated by ChEMBL
Assay Description
Inhibition of PLK3
Bioorg Med Chem Lett 20: 6489-94 (2010)
Article DOI: 10.1016/j.bmcl.2010.09.060
BindingDB Entry DOI: 10.7270/Q2VT1T39
Serine/threonine-protein kinase PLK1
(Homo sapiens (Human))
BDBM50329913
(1-(2-fluoroethyl)-8-(5-(piperazin-1-yl)-2-(trifluo...)
Show SMILES CN1CCN(CC1)c1ccc(OC(F)(F)F)c(Nc2ncc3CCc4c(nn(CCF)c4-c3n2)C(N)=O)c1
Show InChI InChI=1S/C24H26F4N8O2/c1-34-8-10-35(11-9-34)15-3-5-18(38-24(26,27)28)17(12-15)31-23-30-13-14-2-4-16-20(22(29)37)33-36(7-6-25)21(16)19(14)32-23/h3,5,12-13H,2,4,6-11H2,1H3,(H2,29,37)(H,30,31,32)
NCI pathway
Reactome pathway
n/an/a 4n/an/an/an/an/an/a
Nerviano Medical Sciences srl
Curated by ChEMBL
Assay Description
Inhibition of PLK1
Bioorg Med Chem Lett 20: 6489-94 (2010)
Article DOI: 10.1016/j.bmcl.2010.09.060
BindingDB Entry DOI: 10.7270/Q2VT1T39
Serine/threonine-protein kinase NEK6
(Homo sapiens (Human))
BDBM50329913
(1-(2-fluoroethyl)-8-(5-(piperazin-1-yl)-2-(trifluo...)
Show SMILES CN1CCN(CC1)c1ccc(OC(F)(F)F)c(Nc2ncc3CCc4c(nn(CCF)c4-c3n2)C(N)=O)c1
Show InChI InChI=1S/C24H26F4N8O2/c1-34-8-10-35(11-9-34)15-3-5-18(38-24(26,27)28)17(12-15)31-23-30-13-14-2-4-16-20(22(29)37)33-36(7-6-25)21(16)19(14)32-23/h3,5,12-13H,2,4,6-11H2,1H3,(H2,29,37)(H,30,31,32)
Reactome pathway
n/an/a>1.00E+4n/an/an/an/an/an/a
Nerviano Medical Sciences srl
Curated by ChEMBL
Assay Description
Inhibition of NEK6
Bioorg Med Chem Lett 20: 6489-94 (2010)
Article DOI: 10.1016/j.bmcl.2010.09.060
BindingDB Entry DOI: 10.7270/Q2VT1T39
ALK tyrosine kinase receptor
(Homo sapiens (Human))
BDBM50329913
(1-(2-fluoroethyl)-8-(5-(piperazin-1-yl)-2-(trifluo...)
Show SMILES CN1CCN(CC1)c1ccc(OC(F)(F)F)c(Nc2ncc3CCc4c(nn(CCF)c4-c3n2)C(N)=O)c1
Show InChI InChI=1S/C24H26F4N8O2/c1-34-8-10-35(11-9-34)15-3-5-18(38-24(26,27)28)17(12-15)31-23-30-13-14-2-4-16-20(22(29)37)33-36(7-6-25)21(16)19(14)32-23/h3,5,12-13H,2,4,6-11H2,1H3,(H2,29,37)(H,30,31,32)
n/an/a>1.00E+4n/an/an/an/an/an/a
Nerviano Medical Sciences srl
Curated by ChEMBL
Assay Description
Inhibition of ALK
Bioorg Med Chem Lett 20: 6489-94 (2010)
Article DOI: 10.1016/j.bmcl.2010.09.060
BindingDB Entry DOI: 10.7270/Q2VT1T39
Receptor-type tyrosine-protein kinase FLT3
(Homo sapiens (Human))
BDBM50329913
(1-(2-fluoroethyl)-8-(5-(piperazin-1-yl)-2-(trifluo...)
Show SMILES CN1CCN(CC1)c1ccc(OC(F)(F)F)c(Nc2ncc3CCc4c(nn(CCF)c4-c3n2)C(N)=O)c1
Show InChI InChI=1S/C24H26F4N8O2/c1-34-8-10-35(11-9-34)15-3-5-18(38-24(26,27)28)17(12-15)31-23-30-13-14-2-4-16-20(22(29)37)33-36(7-6-25)21(16)19(14)32-23/h3,5,12-13H,2,4,6-11H2,1H3,(H2,29,37)(H,30,31,32)
n/an/a 216n/an/an/an/an/an/a
Nerviano Medical Sciences srl
Curated by ChEMBL
Assay Description
Inhibition of FLT3
Bioorg Med Chem Lett 20: 6489-94 (2010)
Article DOI: 10.1016/j.bmcl.2010.09.060
BindingDB Entry DOI: 10.7270/Q2VT1T39
CDK2/Cyclin A/Cyclin A1
(Homo sapiens (Human))
BDBM50329913
(1-(2-fluoroethyl)-8-(5-(piperazin-1-yl)-2-(trifluo...)
Show SMILES CN1CCN(CC1)c1ccc(OC(F)(F)F)c(Nc2ncc3CCc4c(nn(CCF)c4-c3n2)C(N)=O)c1
Show InChI InChI=1S/C24H26F4N8O2/c1-34-8-10-35(11-9-34)15-3-5-18(38-24(26,27)28)17(12-15)31-23-30-13-14-2-4-16-20(22(29)37)33-36(7-6-25)21(16)19(14)32-23/h3,5,12-13H,2,4,6-11H2,1H3,(H2,29,37)(H,30,31,32)
Reactome pathway
n/an/a>1.00E+4n/an/an/an/an/an/a
Nerviano Medical Sciences srl
Curated by ChEMBL
Assay Description
Inhibition of CDK2/Cyclin A
Bioorg Med Chem Lett 20: 6489-94 (2010)
Article DOI: 10.1016/j.bmcl.2010.09.060
BindingDB Entry DOI: 10.7270/Q2VT1T39