BDBM50329921 8-(5-(4-ethylpiperazin-1-yl)-2-(trifluoromethoxy)phenylamino)-1-methyl-4,5-dihydro-1H-pyrazolo[4,3-h]quinazoline-3-carboxamide::CHEMBL1271590
SMILES: CCN1CCN(CC1)c1ccc(OC(F)(F)F)c(Nc2ncc3CCc4c(nn(C)c4-c3n2)C(N)=O)c1
InChI Key: InChIKey=JKMYPJAZMANXBX-UHFFFAOYSA-N
Data: 4 IC50
Activity Spreadsheet -- Enzyme Inhibition Constant Data from BindingDB
Found 4 hits for monomerid = 50329921
Trg + Lig
Ki
nM
ΔG°
kcal/mole
IC50
nM
Kd
nM
EC50/IC50
nM
koff
s-1
kon
M-1s-1
pHTemp
°C
CDK2/Cyclin A/Cyclin A1
(Homo sapiens (Human))
BDBM50329921
(8-(5-(4-ethylpiperazin-1-yl)-2-(trifluoromethoxy)p...)
Show SMILES CCN1CCN(CC1)c1ccc(OC(F)(F)F)c(Nc2ncc3CCc4c(nn(C)c4-c3n2)C(N)=O)c1
Show InChI InChI=1S/C24H27F3N8O2/c1-3-34-8-10-35(11-9-34)15-5-7-18(37-24(25,26)27)17(12-15)30-23-29-13-14-4-6-16-20(22(28)36)32-33(2)21(16)19(14)31-23/h5,7,12-13H,3-4,6,8-11H2,1-2H3,(H2,28,36)(H,29,30,31)
Reactome pathway
n/an/a>1.00E+4n/an/an/an/an/an/a
Nerviano Medical Sciences srl
Curated by ChEMBL
Assay Description
Inhibition of CDK2/Cyclin A
Bioorg Med Chem Lett 20: 6489-94 (2010)
Article DOI: 10.1016/j.bmcl.2010.09.060
BindingDB Entry DOI: 10.7270/Q2VT1T39
Serine/threonine-protein kinase PLK1
(Homo sapiens (Human))
BDBM50329921
(8-(5-(4-ethylpiperazin-1-yl)-2-(trifluoromethoxy)p...)
Show SMILES CCN1CCN(CC1)c1ccc(OC(F)(F)F)c(Nc2ncc3CCc4c(nn(C)c4-c3n2)C(N)=O)c1
Show InChI InChI=1S/C24H27F3N8O2/c1-3-34-8-10-35(11-9-34)15-5-7-18(37-24(25,26)27)17(12-15)30-23-29-13-14-4-6-16-20(22(28)36)32-33(2)21(16)19(14)31-23/h5,7,12-13H,3-4,6,8-11H2,1-2H3,(H2,28,36)(H,29,30,31)
NCI pathway
Reactome pathway
n/an/a 8n/an/an/an/an/an/a
Nerviano Medical Sciences srl
Curated by ChEMBL
Assay Description
Inhibition of PLK1
Bioorg Med Chem Lett 20: 6489-94 (2010)
Article DOI: 10.1016/j.bmcl.2010.09.060
BindingDB Entry DOI: 10.7270/Q2VT1T39
3D
3D Structure (docked)
Serine/threonine-protein kinase PLK2
(Homo sapiens (Human))
BDBM50329921
(8-(5-(4-ethylpiperazin-1-yl)-2-(trifluoromethoxy)p...)
Show SMILES CCN1CCN(CC1)c1ccc(OC(F)(F)F)c(Nc2ncc3CCc4c(nn(C)c4-c3n2)C(N)=O)c1
Show InChI InChI=1S/C24H27F3N8O2/c1-3-34-8-10-35(11-9-34)15-5-7-18(37-24(25,26)27)17(12-15)30-23-29-13-14-4-6-16-20(22(28)36)32-33(2)21(16)19(14)31-23/h5,7,12-13H,3-4,6,8-11H2,1-2H3,(H2,28,36)(H,29,30,31)
NCI pathway
n/an/a 3.39E+3n/an/an/an/an/an/a
Nerviano Medical Sciences srl
Curated by ChEMBL
Assay Description
Inhibition of PLK2
Bioorg Med Chem Lett 20: 6489-94 (2010)
Article DOI: 10.1016/j.bmcl.2010.09.060
BindingDB Entry DOI: 10.7270/Q2VT1T39
Serine/threonine-protein kinase PLK3
(Homo sapiens (Human))
BDBM50329921
(8-(5-(4-ethylpiperazin-1-yl)-2-(trifluoromethoxy)p...)
Show SMILES CCN1CCN(CC1)c1ccc(OC(F)(F)F)c(Nc2ncc3CCc4c(nn(C)c4-c3n2)C(N)=O)c1
Show InChI InChI=1S/C24H27F3N8O2/c1-3-34-8-10-35(11-9-34)15-5-7-18(37-24(25,26)27)17(12-15)30-23-29-13-14-4-6-16-20(22(28)36)32-33(2)21(16)19(14)31-23/h5,7,12-13H,3-4,6,8-11H2,1-2H3,(H2,28,36)(H,29,30,31)
NCI pathway
n/an/a 1.22E+3n/an/an/an/an/an/a
Nerviano Medical Sciences srl
Curated by ChEMBL
Assay Description
Inhibition of PLK3
Bioorg Med Chem Lett 20: 6489-94 (2010)
Article DOI: 10.1016/j.bmcl.2010.09.060
BindingDB Entry DOI: 10.7270/Q2VT1T39