BDBM50330006 1-((3R,5R)-4-(4-chlorophenylsulfonyl)-5-isopropylmorpholin-3-yl)cyclopropyl 3,8-diazabicyclo[3.2.1]octane-3-carboxylate::CHEMBL1271544
SMILES: CC(C)[C@@H]1COC[C@@H](N1S(=O)(=O)c1ccc(Cl)cc1)C1(CC1)OC(=O)N1CC2CCC(C1)N2
InChI Key: InChIKey=SEUYCXXZPFOTNT-RRIIRSAJSA-N
Data: 1 IC50
Activity Spreadsheet -- Enzyme Inhibition Constant Data from BindingDB
Found 1 hit for monomerid = 50330006
Trg + Lig
Ki
nM
ΔG°
kcal/mole
IC50
nM
Kd
nM
EC50/IC50
nM
koff
s-1
kon
M-1s-1
pHTemp
°C
Cytochrome P450 3A4
(Homo sapiens (Human))
BDBM50330006
(1-((3R,5R)-4-(4-chlorophenylsulfonyl)-5-isopropylm...)
Show SMILES CC(C)[C@@H]1COC[C@@H](N1S(=O)(=O)c1ccc(Cl)cc1)C1(CC1)OC(=O)N1CC2CCC(C1)N2 |r,TLB:23:25:32:28.29|
Show InChI InChI=1S/C23H32ClN3O5S/c1-15(2)20-13-31-14-21(27(20)33(29,30)19-7-3-16(24)4-8-19)23(9-10-23)32-22(28)26-11-17-5-6-18(12-26)25-17/h3-4,7-8,15,17-18,20-21,25H,5-6,9-14H2,1-2H3/t17?,18?,20-,21+/m0/s1
Reactome pathway
n/an/a 0.5n/an/an/an/an/an/a
Merck Research Lab.
Curated by ChEMBL
Assay Description
Inhibition of CYP3A4 after 30 mins
Bioorg Med Chem Lett 20: 6606-9 (2010)
Article DOI: 10.1016/j.bmcl.2010.09.028
BindingDB Entry DOI: 10.7270/Q2RF5V79