BDBM50330099 CHEMBL1271498::N-(4-(3-(pyridin-3-yl)-5-(trifluoromethyl)-1H-pyrazol-1-yl)phenyl)isonicotinamide
SMILES: FC(F)(F)c1cc(nn1-c1ccc(NC(=O)c2ccncc2)cc1)-c1cccnc1
InChI Key: InChIKey=IRVZTUCRPZCREY-UHFFFAOYSA-N
Data: 1 IC50
Activity Spreadsheet -- Enzyme Inhibition Constant Data from BindingDB
Found 1 hit for monomerid = 50330099
Trg + Lig
Ki
nM
ΔG°
kcal/mole
IC50
nM
Kd
nM
EC50/IC50
nM
koff
s-1
kon
M-1s-1
pHTemp
°C
EBifunctional epoxide hydrolase 2
(Homo sapiens (Human))
BDBM50330099
(CHEMBL1271498 | N-(4-(3-(pyridin-3-yl)-5-(trifluor...)
Show SMILES FC(F)(F)c1cc(nn1-c1ccc(NC(=O)c2ccncc2)cc1)-c1cccnc1
Show InChI InChI=1S/C21H14F3N5O/c22-21(23,24)19-12-18(15-2-1-9-26-13-15)28-29(19)17-5-3-16(4-6-17)27-20(30)14-7-10-25-11-8-14/h1-13H,(H,27,30)
n/an/a 7.30n/an/an/an/an/an/a
Boehringer Ingelheim Pharmaceuticals Inc.
Curated by ChEMBL
Assay Description
Inhibition of human Ephx2 after 30 mins by fluorescence polarization assay
Bioorg Med Chem Lett 20: 6379-83 (2010)
Article DOI: 10.1016/j.bmcl.2010.09.095
BindingDB Entry DOI: 10.7270/Q2V69JT7