BDBM50330189 (3S,6S,9S,12R,15S,18S,21S,24S,30S,33S)-12-(3-aminopropyl)-30-ethyl-33-((1R,2R)-1-hydroxy-2-methylhex-4-enyl)-6,9,18,24-tetraisobutyl-3,21-diisopropyl-1,4,7,10,15,19,25,28-octamethyl-1,4,7,10,13,16,19,22,25,28,31-undecaazacyclotritriacontan-2,5,8,11,14,17,20,23,26,29,32-undecaone::CHEMBL1269587
SMILES: CC[C@@H]1NC(=O)[C@H]([C@H](O)[C@H](C)C\C=C\C)N(C)C(=O)[C@H](C(C)C)N(C)C(=O)[C@H](CC(C)C)N(C)C(=O)[C@H](CC(C)C)N(C)C(=O)[C@@H](CCCN)NC(=O)[C@H](C)NC(=O)[C@H](CC(C)C)N(C)C(=O)[C@@H](NC(=O)[C@H](CC(C)C)N(C)C(=O)CN(C)C1=O)C(C)C
InChI Key: InChIKey=CFZGCDHAFXNPIA-VNHFGJPGSA-N
Data: 2 IC50
Activity Spreadsheet -- Enzyme Inhibition Constant Data from BindingDB
Found 2 hits for monomerid = 50330189
Trg + Lig
Ki
nM
ΔG°
kcal/mole
IC50
nM
Kd
nM
EC50/IC50
nM
koff
s-1
kon
M-1s-1
pHTemp
°C
Cyclophilin B (CypB)
(Homo sapiens (Human))
BDBM50330189
((3S,6S,9S,12R,15S,18S,21S,24S,30S,33S)-12-(3-amino...)
Show SMILES CC[C@@H]1NC(=O)[C@H]([C@H](O)[C@H](C)C\C=C\C)N(C)C(=O)[C@H](C(C)C)N(C)C(=O)[C@H](CC(C)C)N(C)C(=O)[C@H](CC(C)C)N(C)C(=O)[C@@H](CCCN)NC(=O)[C@H](C)NC(=O)[C@H](CC(C)C)N(C)C(=O)[C@@H](NC(=O)[C@H](CC(C)C)N(C)C(=O)CN(C)C1=O)C(C)C |r|
Show InChI InChI=1S/C64H116N12O12/c1-24-26-28-42(15)54(78)53-58(82)67-44(25-2)59(83)70(17)35-50(77)71(18)46(31-36(3)4)57(81)69-51(40(11)12)63(87)72(19)47(32-37(5)6)56(80)66-43(16)55(79)68-45(29-27-30-65)60(84)73(20)48(33-38(7)8)61(85)74(21)49(34-39(9)10)62(86)75(22)52(41(13)14)64(88)76(53)23/h24,26,36-49,51-54,78H,25,27-35,65H2,1-23H3,(H,66,80)(H,67,82)(H,68,79)(H,69,81)/b26-24+/t42-,43+,44+,45-,46+,47+,48+,49+,51+,52+,53+,54-/m1/s1
Reactome pathway
n/an/a 1.58E+3n/an/an/an/an/an/a
SCYNEXIS, Inc.
Curated by ChEMBL
Assay Description
Binding affinity to cyclophilin B by ELISA
Bioorg Med Chem Lett 20: 6542-6 (2010)
Article DOI: 10.1016/j.bmcl.2010.09.036
BindingDB Entry DOI: 10.7270/Q2M909NJ
Peptidyl-prolyl cis-trans isomerase A
(Homo sapiens (Human))
BDBM50330189
((3S,6S,9S,12R,15S,18S,21S,24S,30S,33S)-12-(3-amino...)
Show SMILES CC[C@@H]1NC(=O)[C@H]([C@H](O)[C@H](C)C\C=C\C)N(C)C(=O)[C@H](C(C)C)N(C)C(=O)[C@H](CC(C)C)N(C)C(=O)[C@H](CC(C)C)N(C)C(=O)[C@@H](CCCN)NC(=O)[C@H](C)NC(=O)[C@H](CC(C)C)N(C)C(=O)[C@@H](NC(=O)[C@H](CC(C)C)N(C)C(=O)CN(C)C1=O)C(C)C |r|
Show InChI InChI=1S/C64H116N12O12/c1-24-26-28-42(15)54(78)53-58(82)67-44(25-2)59(83)70(17)35-50(77)71(18)46(31-36(3)4)57(81)69-51(40(11)12)63(87)72(19)47(32-37(5)6)56(80)66-43(16)55(79)68-45(29-27-30-65)60(84)73(20)48(33-38(7)8)61(85)74(21)49(34-39(9)10)62(86)75(22)52(41(13)14)64(88)76(53)23/h24,26,36-49,51-54,78H,25,27-35,65H2,1-23H3,(H,66,80)(H,67,82)(H,68,79)(H,69,81)/b26-24+/t42-,43+,44+,45-,46+,47+,48+,49+,51+,52+,53+,54-/m1/s1
Reactome pathway
n/an/a 662n/an/an/an/an/an/a
SCYNEXIS, Inc.
Curated by ChEMBL
Assay Description
Binding affinity to cyclophilin A by ELISA
Bioorg Med Chem Lett 20: 6542-6 (2010)
Article DOI: 10.1016/j.bmcl.2010.09.036
BindingDB Entry DOI: 10.7270/Q2M909NJ