BDBM50330197 (3S,6S,9S,12R,15S,18S,21S,24S,30S,33S)-12-(3-(diethylamino)propyl)-30-ethyl-33-((1R,2R)-1-hydroxy-2-methylhex-4-enyl)-6,9,18,24-tetraisobutyl-3,21-diisopropyl-1,4,7,10,15,19,25,28-octamethyl-1,4,7,10,13,16,19,22,25,28,31-undecaazacyclotritriacontan-2,5,8,11,14,17,20,23,26,29,32-undecaone::CHEMBL1269595
SMILES: CC[C@@H]1NC(=O)[C@H]([C@H](O)[C@H](C)C\C=C\C)N(C)C(=O)[C@H](C(C)C)N(C)C(=O)[C@H](CC(C)C)N(C)C(=O)[C@H](CC(C)C)N(C)C(=O)[C@@H](CCCN(CC)CC)NC(=O)[C@H](C)NC(=O)[C@H](CC(C)C)N(C)C(=O)[C@@H](NC(=O)[C@H](CC(C)C)N(C)C(=O)CN(C)C1=O)C(C)C
InChI Key: InChIKey=ABRYBDDKUCSTFO-KRSXXQRDSA-N
Data: 2 IC50
Activity Spreadsheet -- Enzyme Inhibition Constant Data from BindingDB
Found 2 hits for monomerid = 50330197
Trg + Lig
Ki
nM
ΔG°
kcal/mole
IC50
nM
Kd
nM
EC50/IC50
nM
koff
s-1
kon
M-1s-1
pHTemp
°C
Cyclophilin B (CypB)
(Homo sapiens (Human))
BDBM50330197
((3S,6S,9S,12R,15S,18S,21S,24S,30S,33S)-12-(3-(diet...)
Show SMILES CC[C@@H]1NC(=O)[C@H]([C@H](O)[C@H](C)C\C=C\C)N(C)C(=O)[C@H](C(C)C)N(C)C(=O)[C@H](CC(C)C)N(C)C(=O)[C@H](CC(C)C)N(C)C(=O)[C@@H](CCCN(CC)CC)NC(=O)[C@H](C)NC(=O)[C@H](CC(C)C)N(C)C(=O)[C@@H](NC(=O)[C@H](CC(C)C)N(C)C(=O)CN(C)C1=O)C(C)C |r|
Show InChI InChI=1S/C68H124N12O12/c1-26-30-32-46(17)58(82)57-62(86)70-48(27-2)63(87)73(19)39-54(81)74(20)50(35-40(5)6)61(85)72-55(44(13)14)67(91)75(21)51(36-41(7)8)60(84)69-47(18)59(83)71-49(33-31-34-80(28-3)29-4)64(88)76(22)52(37-42(9)10)65(89)77(23)53(38-43(11)12)66(90)78(24)56(45(15)16)68(92)79(57)25/h26,30,40-53,55-58,82H,27-29,31-39H2,1-25H3,(H,69,84)(H,70,86)(H,71,83)(H,72,85)/b30-26+/t46-,47+,48+,49-,50+,51+,52+,53+,55+,56+,57+,58-/m1/s1
Reactome pathway
n/an/a 17.2n/an/an/an/an/an/a
SCYNEXIS, Inc.
Curated by ChEMBL
Assay Description
Binding affinity to cyclophilin B by ELISA
Bioorg Med Chem Lett 20: 6542-6 (2010)
Article DOI: 10.1016/j.bmcl.2010.09.036
BindingDB Entry DOI: 10.7270/Q2M909NJ
Peptidyl-prolyl cis-trans isomerase A
(Homo sapiens (Human))
BDBM50330197
((3S,6S,9S,12R,15S,18S,21S,24S,30S,33S)-12-(3-(diet...)
Show SMILES CC[C@@H]1NC(=O)[C@H]([C@H](O)[C@H](C)C\C=C\C)N(C)C(=O)[C@H](C(C)C)N(C)C(=O)[C@H](CC(C)C)N(C)C(=O)[C@H](CC(C)C)N(C)C(=O)[C@@H](CCCN(CC)CC)NC(=O)[C@H](C)NC(=O)[C@H](CC(C)C)N(C)C(=O)[C@@H](NC(=O)[C@H](CC(C)C)N(C)C(=O)CN(C)C1=O)C(C)C |r|
Show InChI InChI=1S/C68H124N12O12/c1-26-30-32-46(17)58(82)57-62(86)70-48(27-2)63(87)73(19)39-54(81)74(20)50(35-40(5)6)61(85)72-55(44(13)14)67(91)75(21)51(36-41(7)8)60(84)69-47(18)59(83)71-49(33-31-34-80(28-3)29-4)64(88)76(22)52(37-42(9)10)65(89)77(23)53(38-43(11)12)66(90)78(24)56(45(15)16)68(92)79(57)25/h26,30,40-53,55-58,82H,27-29,31-39H2,1-25H3,(H,69,84)(H,70,86)(H,71,83)(H,72,85)/b30-26+/t46-,47+,48+,49-,50+,51+,52+,53+,55+,56+,57+,58-/m1/s1
Reactome pathway
n/an/a 21.4n/an/an/an/an/an/a
SCYNEXIS, Inc.
Curated by ChEMBL
Assay Description
Binding affinity to cyclophilin A by ELISA
Bioorg Med Chem Lett 20: 6542-6 (2010)
Article DOI: 10.1016/j.bmcl.2010.09.036
BindingDB Entry DOI: 10.7270/Q2M909NJ