BDBM50330238 (E)-4-(Diethylamino)-1-(4-(((1R)-2-hydroxy-1-phenylethyl)-amino)-5,6,7,8-tetrahydropyrido[4',3':4,5]thieno[2,3-d]pyrimidin-7-yl)-2-buten-1-one::CHEMBL1272324
SMILES: CCN(CC)C\C=C\C(=O)N1CCc2c(C1)sc1ncnc(N[C@H](CO)c3ccccc3)c21
InChI Key: InChIKey=ROLISRUBXWRDMG-OJLWIZQOSA-N
Data: 1 IC50
Activity Spreadsheet -- Enzyme Inhibition Constant Data from BindingDB
Found 1 hit for monomerid = 50330238
Trg + Lig
Ki
nM
ΔG°
kcal/mole
IC50
nM
Kd
nM
EC50/IC50
nM
koff
s-1
kon
M-1s-1
pHTemp
°C
Epidermal growth factor receptor
(Homo sapiens (Human))
BDBM50330238
((E)-4-(Diethylamino)-1-(4-(((1R)-2-hydroxy-1-pheny...)
Show SMILES CCN(CC)C\C=C\C(=O)N1CCc2c(C1)sc1ncnc(N[C@H](CO)c3ccccc3)c21 |r|
Show InChI InChI=1S/C25H31N5O2S/c1-3-29(4-2)13-8-11-22(32)30-14-12-19-21(15-30)33-25-23(19)24(26-17-27-25)28-20(16-31)18-9-6-5-7-10-18/h5-11,17,20,31H,3-4,12-16H2,1-2H3,(H,26,27,28)/b11-8+/t20-/m1/s1
n/an/a 9n/an/an/an/an/an/a
National Health Research Institutes
Curated by ChEMBL
Assay Description
Inhibition of EGFR
J Med Chem 53: 7316-26 (2010)
Article DOI: 10.1021/jm100607r
BindingDB Entry DOI: 10.7270/Q26D5T64