BDBM50330328 (Z)-2-amino-9-((2,2-bis(hydroxymethyl)cyclopropylidene)methyl)-1H-purin-6(9H)-one::(Z)-9-((2,2-bis(hydroxymethyl)cyclopropylidene)methyl)-2-amino-1H-purin-6(9H)-one::2-Amino-9-[2,2-bis-hydroxymethyl-cycloprop-(Z)-ylidenemethyl]-1,9-dihydro-purin-6-one::CHEMBL265948::cyclopropavir
SMILES: Nc1nc2n(\C=C3\CC3(CO)CO)cnc2c(=O)[nH]1
InChI Key: InChIKey=KMUNHOKTIVSFRA-KXFIGUGUSA-N
Data: 1 KI
Activity Spreadsheet -- Enzyme Inhibition Constant Data from BindingDB
Found 1 hit for monomerid = 50330328
Trg + Lig
Ki
nM
ΔG°
kcal/mole
IC50
nM
Kd
nM
EC50/IC50
nM
koff
s-1
kon
M-1s-1
pHTemp
°C
Phosphotransferase pUL97
(Human cytomegalovirus)
BDBM50330328
((Z)-2-amino-9-((2,2-bis(hydroxymethyl)cyclopropyli...)
Show SMILES Nc1nc2n(\C=C3\CC3(CO)CO)cnc2c(=O)[nH]1
Show InChI InChI=1S/C11H13N5O3/c12-10-14-8-7(9(19)15-10)13-5-16(8)2-6-1-11(6,3-17)4-18/h2,5,17-18H,1,3-4H2,(H3,12,14,15,19)/b6-2-
3n/an/an/an/an/an/an/an/a
University of Michigan
Curated by ChEMBL
Assay Description
Inhibition of Human cytomegalovirus pUL97 assessed as inhibition of phosphorylation of 100 to 1000 uM cyclopropavir
Antimicrob Agents Chemother 54: 3093-8 (2010)
Article DOI: 10.1128/AAC.00468-10
BindingDB Entry DOI: 10.7270/Q25D8S36