BDBM50330346 4-((3S,4R,5R)-3-(methoxymethyl)-5-(naphthalen-2-ylmethoxy)piperidin-4-yl)benzyl 2-chlorobenzoate::4-[(4R,5R)-3-(METHOXYMETHYL)-5-(2-NAPHTHYLMETHOXY)PIPERIDIN-4-YL]BENZYL 2-CHLOROBENZOATE::CHEMBL1235623
SMILES: COC[C@@H]1CNC[C@H](OCc2ccc3ccccc3c2)[C@H]1c1ccc(COC(=O)c2ccccc2Cl)cc1
InChI Key: InChIKey=MDNCEOVGVRNOIK-NAYUSWPISA-N
Data: 1 IC50
Activity Spreadsheet -- Enzyme Inhibition Constant Data from BindingDB
Found 1 hit for monomerid = 50330346
Trg + Lig
Ki
nM
ΔG°
kcal/mole
IC50
nM
Kd
nM
EC50/IC50
nM
koff
s-1
kon
M-1s-1
pHTemp
°C
Renin
(Homo sapiens (Human))
BDBM50330346
(4-((3S,4R,5R)-3-(methoxymethyl)-5-(naphthalen-2-yl...)
Show SMILES COC[C@@H]1CNC[C@H](OCc2ccc3ccccc3c2)[C@H]1c1ccc(COC(=O)c2ccccc2Cl)cc1 |r|
Show InChI InChI=1S/C32H32ClNO4/c1-36-21-27-17-34-18-30(37-20-23-12-13-24-6-2-3-7-26(24)16-23)31(27)25-14-10-22(11-15-25)19-38-32(35)28-8-4-5-9-29(28)33/h2-16,27,30-31,34H,17-21H2,1H3/t27-,30-,31-/m0/s1
Reactome pathway
n/an/a 2n/an/an/an/an/an/a
Novartis Pharmaceuticals Corp
Curated by ChEMBL
Assay Description
Inhibition of human recombinant renin in buffer
J Med Chem 53: 7490-520 (2010)
Article DOI: 10.1021/jm901885s
BindingDB Entry DOI: 10.7270/Q2S75GKG