null
SMILES: CCc1nc(N)nc(N)c1-c1ccc2OC(C)(C(=O)N(CCCOC)c2c1)c1cc(F)cc(F)c1
InChI Key: InChIKey=UAXNNGUDPWZOKX-UHFFFAOYSA-N
Activity Spreadsheet -- Enzyme Inhibition Constant Data from BindingDB
Found 3 hits for monomerid = 50330347
Trg + Lig
Ki
nM
ΔG°
kcal/mole
IC50
nM
Kd
nM
EC50/IC50
nM
koff
s-1
kon
M-1s-1
pHTemp
°C
Renin
(Homo sapiens (Human))
BDBM50330347
(6-(2,4-diamino-6-ethyl-pyrimidin-5-yl)-2-(3,5-difl...)
Show SMILES CCc1nc(N)nc(N)c1-c1ccc2OC(C)(C(=O)N(CCCOC)c2c1)c1cc(F)cc(F)c1 |w:15.16|
Show InChI InChI=1S/C25H27F2N5O3/c1-4-18-21(22(28)31-24(29)30-18)14-6-7-20-19(10-14)32(8-5-9-34-3)23(33)25(2,35-20)15-11-16(26)13-17(27)12-15/h6-7,10-13H,4-5,8-9H2,1-3H3,(H4,28,29,30,31)
Reactome pathway
n/an/a 7n/an/an/an/an/an/a
Novartis Pharmaceuticals Corp
Curated by ChEMBL
Assay Description
Inhibition of human recombinant renin in buffer
J Med Chem 53: 7490-520 (2010)
Article DOI: 10.1021/jm901885s
BindingDB Entry DOI: 10.7270/Q2S75GKG
3D
3D Structure (docked)
Renin
(Homo sapiens (Human))
BDBM50330347
(6-(2,4-diamino-6-ethyl-pyrimidin-5-yl)-2-(3,5-difl...)
Show SMILES CCc1nc(N)nc(N)c1-c1ccc2OC(C)(C(=O)N(CCCOC)c2c1)c1cc(F)cc(F)c1 |w:15.16|
Show InChI InChI=1S/C25H27F2N5O3/c1-4-18-21(22(28)31-24(29)30-18)14-6-7-20-19(10-14)32(8-5-9-34-3)23(33)25(2,35-20)15-11-16(26)13-17(27)12-15/h6-7,10-13H,4-5,8-9H2,1-3H3,(H4,28,29,30,31)
Reactome pathway
n/an/a 7n/an/an/an/an/an/a
BioLeap, Inc., 6350 Quadrangle Drive, Suite 110, Chapel Hill, NC 27517, United States. Electronic address: isclou@gmail.com.
Curated by ChEMBL
Assay Description
Inhibition of recombinant human renin
Bioorg Med Chem 25: 3947-3963 (2017)
Article DOI: 10.1016/j.bmc.2017.05.032
BindingDB Entry DOI: 10.7270/Q2X63QD8
3D
3D Structure (docked)
Renin
(Homo sapiens (Human))
BDBM50330347
(6-(2,4-diamino-6-ethyl-pyrimidin-5-yl)-2-(3,5-difl...)
Show SMILES CCc1nc(N)nc(N)c1-c1ccc2OC(C)(C(=O)N(CCCOC)c2c1)c1cc(F)cc(F)c1 |w:15.16|
Show InChI InChI=1S/C25H27F2N5O3/c1-4-18-21(22(28)31-24(29)30-18)14-6-7-20-19(10-14)32(8-5-9-34-3)23(33)25(2,35-20)15-11-16(26)13-17(27)12-15/h6-7,10-13H,4-5,8-9H2,1-3H3,(H4,28,29,30,31)
Reactome pathway
n/an/a 7.10n/an/an/an/an/an/a
Gyeongsang National University (GNU)
Curated by ChEMBL
Assay Description
Inhibition of human renin
Eur J Med Chem 46: 2469-76 (2011)
Article DOI: 10.1016/j.ejmech.2011.03.035
BindingDB Entry DOI: 10.7270/Q2GM87NM
3D
3D Structure (docked)