BDBM50330351 CHEMBL1276277::N-(2-(7-(((R)-1-(4-(3-(2-methoxybenzyloxy)propoxy)phenyl)piperazin-2-yl)methoxy)-2,3,4,4a-tetrahydroquinolin-1(8aH)-yl)ethyl)acetamide
SMILES: COc1ccccc1COCCCOc1ccc(cc1)N1CCNC[C@@H]1COC1=CC2C(CCCN2CCNC(C)=O)C=C1
InChI Key: InChIKey=HRBKKSHDZGRQIV-IEPGKUISSA-N
Data: 1 IC50
Activity Spreadsheet -- Enzyme Inhibition Constant Data from BindingDB
Found 1 hit for monomerid = 50330351
Trg + Lig
Ki
nM
ΔG°
kcal/mole
IC50
nM
Kd
nM
EC50/IC50
nM
koff
s-1
kon
M-1s-1
pHTemp
°C
Renin
(Homo sapiens (Human))
BDBM50330351
(CHEMBL1276277 | N-(2-(7-(((R)-1-(4-(3-(2-methoxybe...)
Show SMILES COc1ccccc1COCCCOc1ccc(cc1)N1CCNC[C@@H]1COC1=CC2C(CCCN2CCNC(C)=O)C=C1 |r,c:46,t:31|
Show InChI InChI=1S/C35H48N4O5/c1-27(40)37-17-19-38-18-5-8-28-10-13-33(23-34(28)38)44-26-31-24-36-16-20-39(31)30-11-14-32(15-12-30)43-22-6-21-42-25-29-7-3-4-9-35(29)41-2/h3-4,7,9-15,23,28,31,34,36H,5-6,8,16-22,24-26H2,1-2H3,(H,37,40)/t28?,31-,34?/m1/s1
Reactome pathway
n/an/a 0.5n/an/an/an/an/an/a
Novartis Pharmaceuticals Corp
Curated by ChEMBL
Assay Description
Inhibition of human recombinant renin in buffer
J Med Chem 53: 7490-520 (2010)
Article DOI: 10.1021/jm901885s
BindingDB Entry DOI: 10.7270/Q2S75GKG