BDBM50330353 6-(((R)-1-(4-(3-(2-methoxybenzyloxy)propoxy)phenyl)-6-oxopiperazin-2-yl)methoxy)-4-(3-methoxypropyl)-4,4a-dihydro-2H-benzo[b][1,4]oxazin-3(8aH)-one::CHEMBL1276279
SMILES: COCCCN1C2C=C(OC[C@H]3CNCC(=O)N3c3ccc(OCCCOCc4ccccc4OC)cc3)C=CC2OCC1=O
InChI Key: InChIKey=YRPYLNFZCQQUNP-BNQSOOPWSA-N
Data: 1 IC50
Activity Spreadsheet -- Enzyme Inhibition Constant Data from BindingDB
Found 1 hit for monomerid = 50330353
Trg + Lig
Ki
nM
ΔG°
kcal/mole
IC50
nM
Kd
nM
EC50/IC50
nM
koff
s-1
kon
M-1s-1
pHTemp
°C
Renin
(Homo sapiens (Human))
BDBM50330353
(6-(((R)-1-(4-(3-(2-methoxybenzyloxy)propoxy)phenyl...)
Show SMILES COCCCN1C2C=C(OC[C@H]3CNCC(=O)N3c3ccc(OCCCOCc4ccccc4OC)cc3)C=CC2OCC1=O |r,c:41,t:7|
Show InChI InChI=1S/C34H43N3O8/c1-40-16-5-15-36-30-19-29(13-14-32(30)45-24-34(36)39)44-23-27-20-35-21-33(38)37(27)26-9-11-28(12-10-26)43-18-6-17-42-22-25-7-3-4-8-31(25)41-2/h3-4,7-14,19,27,30,32,35H,5-6,15-18,20-24H2,1-2H3/t27-,30?,32?/m1/s1
Reactome pathway
n/an/a 0.680n/an/an/an/an/an/a
Novartis Pharmaceuticals Corp
Curated by ChEMBL
Assay Description
Inhibition of human recombinant renin in buffer
J Med Chem 53: 7490-520 (2010)
Article DOI: 10.1021/jm901885s
BindingDB Entry DOI: 10.7270/Q2S75GKG