BDBM50330355 (1R,5S)-N-cyclopropyl-7-(4-(2-(2,6-dichloro-4-methylphenoxy)ethoxy)phenyl)-N-(2,3-dimethylbenzyl)-3,9-diazabicyclo[3.3.1]non-6-ene-6-carboxamide::(1R,5S)-N-cyclopropyl-7-{4-[2-(2,6-dichloro-4-methylphenoxy)ethoxy]phenyl}-N-(2,3-dimethylbenzyl)-3,9-diazabicyclo[3.3.1]non-6-ene-6-carboxamide::CHEMBL1230745
SMILES: Cc1cc(Cl)c(OCCOc2ccc(cc2)C2=C([C@H]3CNC[C@@H](C2)N3)C(=O)N(Cc2cccc(C)c2C)C2CC2)c(Cl)c1
InChI Key: InChIKey=VKBBVOVNGWGZCA-HVIPQOSHSA-N
Data: 3 IC50
PDB links: 1 PDB ID matches this monomer.
Activity Spreadsheet -- Enzyme Inhibition Constant Data from BindingDB
Found 3 hits for monomerid = 50330355
Trg + Lig
Ki
nM
ΔG°
kcal/mole
IC50
nM
Kd
nM
EC50/IC50
nM
koff
s-1
kon
M-1s-1
pHTemp
°C
Renin
(Homo sapiens (Human))
BDBM50330355
((1R,5S)-N-cyclopropyl-7-(4-(2-(2,6-dichloro-4-meth...)
Show SMILES Cc1cc(Cl)c(OCCOc2ccc(cc2)C2=C([C@H]3CNC[C@@H](C2)N3)C(=O)N(Cc2cccc(C)c2C)C2CC2)c(Cl)c1 |r,t:17|
Show InChI InChI=1S/C35H39Cl2N3O3/c1-21-15-30(36)34(31(37)16-21)43-14-13-42-28-11-7-24(8-12-28)29-17-26-18-38-19-32(39-26)33(29)35(41)40(27-9-10-27)20-25-6-4-5-22(2)23(25)3/h4-8,11-12,15-16,26-27,32,38-39H,9-10,13-14,17-20H2,1-3H3/t26-,32-/m1/s1
Reactome pathway
n/an/a 19n/an/an/an/an/an/a
Novartis Pharmaceuticals Corp
Curated by ChEMBL
Assay Description
Inhibition of renin in plasma
J Med Chem 53: 7490-520 (2010)
Article DOI: 10.1021/jm901885s
BindingDB Entry DOI: 10.7270/Q2S75GKG
3D
3D Structure (crystal)
Renin
(Homo sapiens (Human))
BDBM50330355
((1R,5S)-N-cyclopropyl-7-(4-(2-(2,6-dichloro-4-meth...)
Show SMILES Cc1cc(Cl)c(OCCOc2ccc(cc2)C2=C([C@H]3CNC[C@@H](C2)N3)C(=O)N(Cc2cccc(C)c2C)C2CC2)c(Cl)c1 |r,t:17|
Show InChI InChI=1S/C35H39Cl2N3O3/c1-21-15-30(36)34(31(37)16-21)43-14-13-42-28-11-7-24(8-12-28)29-17-26-18-38-19-32(39-26)33(29)35(41)40(27-9-10-27)20-25-6-4-5-22(2)23(25)3/h4-8,11-12,15-16,26-27,32,38-39H,9-10,13-14,17-20H2,1-3H3/t26-,32-/m1/s1
Reactome pathway
n/an/a 0.160n/an/an/an/an/an/a
Gyeongsang National University (GNU)
Curated by ChEMBL
Assay Description
Inhibition of human renin
Eur J Med Chem 46: 2469-76 (2011)
Article DOI: 10.1016/j.ejmech.2011.03.035
BindingDB Entry DOI: 10.7270/Q2GM87NM
3D
3D Structure (crystal)
Renin
(Homo sapiens (Human))
BDBM50330355
((1R,5S)-N-cyclopropyl-7-(4-(2-(2,6-dichloro-4-meth...)
Show SMILES Cc1cc(Cl)c(OCCOc2ccc(cc2)C2=C([C@H]3CNC[C@@H](C2)N3)C(=O)N(Cc2cccc(C)c2C)C2CC2)c(Cl)c1 |r,t:17|
Show InChI InChI=1S/C35H39Cl2N3O3/c1-21-15-30(36)34(31(37)16-21)43-14-13-42-28-11-7-24(8-12-28)29-17-26-18-38-19-32(39-26)33(29)35(41)40(27-9-10-27)20-25-6-4-5-22(2)23(25)3/h4-8,11-12,15-16,26-27,32,38-39H,9-10,13-14,17-20H2,1-3H3/t26-,32-/m1/s1
Reactome pathway
n/an/a 0.200n/an/an/an/an/an/a
Novartis Pharmaceuticals Corp
Curated by ChEMBL
Assay Description
Inhibition of human recombinant renin in buffer
J Med Chem 53: 7490-520 (2010)
Article DOI: 10.1021/jm901885s
BindingDB Entry DOI: 10.7270/Q2S75GKG
3D
3D Structure (crystal)