BDBM50330486 3-Amino-6-chloro-2-[4-(4-quinolin-2-ylpiperazin-1-yl)butyl]-3Hquinazolin-4-one::CHEMBL1277833
SMILES: Nn1c(CCCCN2CCN(CC2)c2ccc3ccccc3n2)nc2ccc(Cl)cc2c1=O
InChI Key: InChIKey=TZSHYDBBXRRBCE-UHFFFAOYSA-N
Data: 1 IC50
Activity Spreadsheet -- Enzyme Inhibition Constant Data from BindingDB
Found 1 hit for monomerid = 50330486
Trg + Lig
Ki
nM
ΔG°
kcal/mole
IC50
nM
Kd
nM
EC50/IC50
nM
koff
s-1
kon
M-1s-1
pHTemp
°C
5-hydroxytryptamine receptor 3A
(Homo sapiens (Human))
BDBM50330486
(3-Amino-6-chloro-2-[4-(4-quinolin-2-ylpiperazin-1-...)
Show SMILES Nn1c(CCCCN2CCN(CC2)c2ccc3ccccc3n2)nc2ccc(Cl)cc2c1=O
Show InChI InChI=1S/C25H27ClN6O/c26-19-9-10-22-20(17-19)25(33)32(27)24(29-22)7-3-4-12-30-13-15-31(16-14-30)23-11-8-18-5-1-2-6-21(18)28-23/h1-2,5-6,8-11,17H,3-4,7,12-16,27H2
Reactome pathway
n/an/a>100n/an/an/an/an/an/a
ASKA Pharmaceutical Co, Ltd
Curated by ChEMBL
Assay Description
Displacement of [3H]BRL-43694 from human 5HT3 receptor expressed in HEK293 cells by liquid scintillation counting
J Med Chem 53: 7549-63 (2010)
Article DOI: 10.1021/jm1002292
BindingDB Entry DOI: 10.7270/Q27082D1