BDBM50330487 3-Amino-2-[4-[4-(7,8,9,10-tetrahydrophenanthridin-6-yl)piperazin-1-yl]butyl]-5,6,7,8-tetrahydro-3H-quinazolin-4-one::CHEMBL1277189
SMILES: Nn1c(CCCCN2CCN(CC2)c2nc3ccccc3c3CCCCc23)nc2CCCCc2c1=O
InChI Key: InChIKey=WOXCQSXEHWXACS-UHFFFAOYSA-N
Data: 2 IC50
Activity Spreadsheet -- Enzyme Inhibition Constant Data from BindingDB
Found 2 hits for monomerid = 50330487
Trg + Lig
Ki
nM
ΔG°
kcal/mole
IC50
nM
Kd
nM
EC50/IC50
nM
koff
s-1
kon
M-1s-1
pHTemp
°C
5-hydroxytryptamine receptor 3A
(Homo sapiens (Human))
BDBM50330487
(3-Amino-2-[4-[4-(7,8,9,10-tetrahydrophenanthridin-...)
Show SMILES Nn1c(CCCCN2CCN(CC2)c2nc3ccccc3c3CCCCc23)nc2CCCCc2c1=O
Show InChI InChI=1S/C29H38N6O/c30-35-27(31-26-14-6-4-12-24(26)29(35)36)15-7-8-16-33-17-19-34(20-18-33)28-23-11-2-1-9-21(23)22-10-3-5-13-25(22)32-28/h3,5,10,13H,1-2,4,6-9,11-12,14-20,30H2
Reactome pathway
n/an/a>100n/an/an/an/an/an/a
ASKA Pharmaceutical Co, Ltd
Curated by ChEMBL
Assay Description
Displacement of [3H]BRL-43694 from human 5HT3 receptor expressed in HEK293 cells by liquid scintillation counting
J Med Chem 53: 7549-63 (2010)
Article DOI: 10.1021/jm1002292
BindingDB Entry DOI: 10.7270/Q27082D1
5-hydroxytryptamine receptor 1A
(Homo sapiens (Human))
BDBM50330487
(3-Amino-2-[4-[4-(7,8,9,10-tetrahydrophenanthridin-...)
Show SMILES Nn1c(CCCCN2CCN(CC2)c2nc3ccccc3c3CCCCc23)nc2CCCCc2c1=O
Show InChI InChI=1S/C29H38N6O/c30-35-27(31-26-14-6-4-12-24(26)29(35)36)15-7-8-16-33-17-19-34(20-18-33)28-23-11-2-1-9-21(23)22-10-3-5-13-25(22)32-28/h3,5,10,13H,1-2,4,6-9,11-12,14-20,30H2
n/an/a>100n/an/an/an/an/an/a
ASKA Pharmaceutical Co, Ltd
Curated by ChEMBL
Assay Description
Displacement of [3H]8-OH-DPAT from human 5HT1A receptor expressed in CHO cells by liquid scintillation counting
J Med Chem 53: 7549-63 (2010)
Article DOI: 10.1021/jm1002292
BindingDB Entry DOI: 10.7270/Q27082D1