BDBM50330493 CHEMBL1277748::N-(3-(diethylamino)propyl)-2,5-dimethoxybenzenesulfonamide
SMILES: CCN(CC)CCCNS(=O)(=O)c1cc(OC)ccc1OC
InChI Key: InChIKey=XDTXBRPWMNLHTI-UHFFFAOYSA-N
Data: 4 IC50
Activity Spreadsheet -- Enzyme Inhibition Constant Data from BindingDB
Found 4 hits for monomerid = 50330493
Trg + Lig
Ki
nM
ΔG°
kcal/mole
IC50
nM
Kd
nM
EC50/IC50
nM
koff
s-1
kon
M-1s-1
pHTemp
°C
Lethal(3)malignant brain tumor-like protein 1 (L3MBTL1)
(Homo sapiens (Human))
BDBM50330493
(CHEMBL1277748 | N-(3-(diethylamino)propyl)-2,5-dim...)
Show SMILES CCN(CC)CCCNS(=O)(=O)c1cc(OC)ccc1OC
Show InChI InChI=1S/C15H26N2O4S/c1-5-17(6-2)11-7-10-16-22(18,19)15-12-13(20-3)8-9-14(15)21-4/h8-9,12,16H,5-7,10-11H2,1-4H3
n/an/a>1.00E+5n/an/an/an/an/an/a
University of North Carolina at Chapel Hill
Curated by ChEMBL
Assay Description
Inhibition of L3MBTL1 by alpha-screening
J Med Chem 53: 7625-31 (2010)
Article DOI: 10.1021/jm1007374
BindingDB Entry DOI: 10.7270/Q23B614G
Lethal(3)malignant brain tumor-like protein 3 (L3MBTL3)
(Homo sapiens (Human))
BDBM50330493
(CHEMBL1277748 | N-(3-(diethylamino)propyl)-2,5-dim...)
Show SMILES CCN(CC)CCCNS(=O)(=O)c1cc(OC)ccc1OC
Show InChI InChI=1S/C15H26N2O4S/c1-5-17(6-2)11-7-10-16-22(18,19)15-12-13(20-3)8-9-14(15)21-4/h8-9,12,16H,5-7,10-11H2,1-4H3
n/an/a 4.80E+4n/an/an/an/an/an/a
University of North Carolina at Chapel Hill
Curated by ChEMBL
Assay Description
Inhibition of L3MBTL3 by alpha-screening
J Med Chem 53: 7625-31 (2010)
Article DOI: 10.1021/jm1007374
BindingDB Entry DOI: 10.7270/Q23B614G
Lethal(3)malignant brain tumor-like protein 4
(Homo sapiens (Human))
BDBM50330493
(CHEMBL1277748 | N-(3-(diethylamino)propyl)-2,5-dim...)
Show SMILES CCN(CC)CCCNS(=O)(=O)c1cc(OC)ccc1OC
Show InChI InChI=1S/C15H26N2O4S/c1-5-17(6-2)11-7-10-16-22(18,19)15-12-13(20-3)8-9-14(15)21-4/h8-9,12,16H,5-7,10-11H2,1-4H3
n/an/a>1.00E+5n/an/an/an/an/an/a
University of North Carolina at Chapel Hill
Curated by ChEMBL
Assay Description
Inhibition of L3MBTL4 by alpha-screening
J Med Chem 53: 7625-31 (2010)
Article DOI: 10.1021/jm1007374
BindingDB Entry DOI: 10.7270/Q23B614G
MBT domain-containing protein 1 (MBTD1)
(Homo sapiens (Human))
BDBM50330493
(CHEMBL1277748 | N-(3-(diethylamino)propyl)-2,5-dim...)
Show SMILES CCN(CC)CCCNS(=O)(=O)c1cc(OC)ccc1OC
Show InChI InChI=1S/C15H26N2O4S/c1-5-17(6-2)11-7-10-16-22(18,19)15-12-13(20-3)8-9-14(15)21-4/h8-9,12,16H,5-7,10-11H2,1-4H3
n/an/a>1.00E+5n/an/an/an/an/an/a
University of North Carolina at Chapel Hill
Curated by ChEMBL
Assay Description
Inhibition of MBTD1 by alpha-screening
J Med Chem 53: 7625-31 (2010)
Article DOI: 10.1021/jm1007374
BindingDB Entry DOI: 10.7270/Q23B614G