BDBM50330497 3-chloro-N-(3-(diethylamino)propyl)-4-fluorobenzenesulfonamide::CHEMBL1275728
SMILES: CCN(CC)CCCNS(=O)(=O)c1ccc(F)c(Cl)c1
InChI Key: InChIKey=BWRRMRDTWHDSFT-UHFFFAOYSA-N
Data: 4 IC50
Activity Spreadsheet -- Enzyme Inhibition Constant Data from BindingDB
Found 4 hits for monomerid = 50330497
Trg + Lig
Ki
nM
ΔG°
kcal/mole
IC50
nM
Kd
nM
EC50/IC50
nM
koff
s-1
kon
M-1s-1
pHTemp
°C
Lethal(3)malignant brain tumor-like protein 3 (L3MBTL3)
(Homo sapiens (Human))
BDBM50330497
(3-chloro-N-(3-(diethylamino)propyl)-4-fluorobenzen...)
Show SMILES CCN(CC)CCCNS(=O)(=O)c1ccc(F)c(Cl)c1
Show InChI InChI=1S/C13H20ClFN2O2S/c1-3-17(4-2)9-5-8-16-20(18,19)11-6-7-13(15)12(14)10-11/h6-7,10,16H,3-5,8-9H2,1-2H3
n/an/a>3.00E+4n/an/an/an/an/an/a
University of North Carolina at Chapel Hill
Curated by ChEMBL
Assay Description
Inhibition of L3MBTL3 by alpha-screening
J Med Chem 53: 7625-31 (2010)
Article DOI: 10.1021/jm1007374
BindingDB Entry DOI: 10.7270/Q23B614G
Lethal(3)malignant brain tumor-like protein 4
(Homo sapiens (Human))
BDBM50330497
(3-chloro-N-(3-(diethylamino)propyl)-4-fluorobenzen...)
Show SMILES CCN(CC)CCCNS(=O)(=O)c1ccc(F)c(Cl)c1
Show InChI InChI=1S/C13H20ClFN2O2S/c1-3-17(4-2)9-5-8-16-20(18,19)11-6-7-13(15)12(14)10-11/h6-7,10,16H,3-5,8-9H2,1-2H3
n/an/a>1.00E+5n/an/an/an/an/an/a
University of North Carolina at Chapel Hill
Curated by ChEMBL
Assay Description
Inhibition of L3MBTL4 by alpha-screening
J Med Chem 53: 7625-31 (2010)
Article DOI: 10.1021/jm1007374
BindingDB Entry DOI: 10.7270/Q23B614G
MBT domain-containing protein 1 (MBTD1)
(Homo sapiens (Human))
BDBM50330497
(3-chloro-N-(3-(diethylamino)propyl)-4-fluorobenzen...)
Show SMILES CCN(CC)CCCNS(=O)(=O)c1ccc(F)c(Cl)c1
Show InChI InChI=1S/C13H20ClFN2O2S/c1-3-17(4-2)9-5-8-16-20(18,19)11-6-7-13(15)12(14)10-11/h6-7,10,16H,3-5,8-9H2,1-2H3
n/an/a>1.00E+5n/an/an/an/an/an/a
University of North Carolina at Chapel Hill
Curated by ChEMBL
Assay Description
Inhibition of MBTD1 by alpha-screening
J Med Chem 53: 7625-31 (2010)
Article DOI: 10.1021/jm1007374
BindingDB Entry DOI: 10.7270/Q23B614G
Lethal(3)malignant brain tumor-like protein 1 (L3MBTL1)
(Homo sapiens (Human))
BDBM50330497
(3-chloro-N-(3-(diethylamino)propyl)-4-fluorobenzen...)
Show SMILES CCN(CC)CCCNS(=O)(=O)c1ccc(F)c(Cl)c1
Show InChI InChI=1S/C13H20ClFN2O2S/c1-3-17(4-2)9-5-8-16-20(18,19)11-6-7-13(15)12(14)10-11/h6-7,10,16H,3-5,8-9H2,1-2H3
n/an/a>1.00E+5n/an/an/an/an/an/a
University of North Carolina at Chapel Hill
Curated by ChEMBL
Assay Description
Inhibition of L3MBTL1 by alpha-screening
J Med Chem 53: 7625-31 (2010)
Article DOI: 10.1021/jm1007374
BindingDB Entry DOI: 10.7270/Q23B614G