BDBM50330518 1-ethyl-3-(naphthalen-1-ylsulfonyl)-5-(piperazin-1-yl)-1H-indazole::CHEMBL1277657
SMILES: CCn1nc(c2cc(ccc12)N1CCNCC1)S(=O)(=O)c1cccc2ccccc12
InChI Key: InChIKey=CJXHIKZSQLENLO-UHFFFAOYSA-N
Data: 1 KI  1 IC50
Activity Spreadsheet -- Enzyme Inhibition Constant Data from BindingDB
Found 2 hits for monomerid = 50330518
Trg + Lig
Ki
nM
ΔG°
kcal/mole
IC50
nM
Kd
nM
EC50/IC50
nM
koff
s-1
kon
M-1s-1
pHTemp
°C
5-hydroxytryptamine receptor 6
(Homo sapiens (Human))
BDBM50330518
(1-ethyl-3-(naphthalen-1-ylsulfonyl)-5-(piperazin-1...)
Show SMILES CCn1nc(c2cc(ccc12)N1CCNCC1)S(=O)(=O)c1cccc2ccccc12
Show InChI InChI=1S/C23H24N4O2S/c1-2-27-21-11-10-18(26-14-12-24-13-15-26)16-20(21)23(25-27)30(28,29)22-9-5-7-17-6-3-4-8-19(17)22/h3-11,16,24H,2,12-15H2,1H3
Reactome pathway
1.90n/an/an/an/an/an/an/an/a
Wyeth Research
Curated by ChEMBL
Assay Description
Displacement of [3H]LSD from human cloned 5HT6 receptor expressed in human HeLa cells
J Med Chem 53: 7639-46 (2010)
Article DOI: 10.1021/jm1007825
BindingDB Entry DOI: 10.7270/Q2GQ6XZ6
5-hydroxytryptamine receptor 6
(Homo sapiens (Human))
BDBM50330518
(1-ethyl-3-(naphthalen-1-ylsulfonyl)-5-(piperazin-1...)
Show SMILES CCn1nc(c2cc(ccc12)N1CCNCC1)S(=O)(=O)c1cccc2ccccc12
Show InChI InChI=1S/C23H24N4O2S/c1-2-27-21-11-10-18(26-14-12-24-13-15-26)16-20(21)23(25-27)30(28,29)22-9-5-7-17-6-3-4-8-19(17)22/h3-11,16,24H,2,12-15H2,1H3
Reactome pathway
n/an/a 1.90n/an/an/an/an/an/a
Wyeth Research
Curated by ChEMBL
Assay Description
Antagonist activity at human cloned 5HT6 receptor expressed in human HeLa cells by cyclase assay
J Med Chem 53: 7639-46 (2010)
Article DOI: 10.1021/jm1007825
BindingDB Entry DOI: 10.7270/Q2GQ6XZ6