null
SMILES: O=c1cc(OCc2ccccc2)ccn1-c1ccc2n(C[C@@H]3CCCN3)ncc2c1
InChI Key: InChIKey=QKLSEEQZERDNCY-FQEVSTJZSA-N
Activity Spreadsheet -- Enzyme Inhibition Constant Data from BindingDB
Found 2 hits for monomerid = 50331249
Trg + Lig
Ki
nM
ΔG°
kcal/mole
IC50
nM
Kd
nM
EC50/IC50
nM
koff
s-1
kon
M-1s-1
pHTemp
°C
Melanin-concentrating hormone receptor 1
(Homo sapiens (Human))
BDBM50331249
((S)-4-(benzyloxy)-1-(1-(pyrrolidin-2-ylmethyl)-1H-...)
Show SMILES O=c1cc(OCc2ccccc2)ccn1-c1ccc2n(C[C@@H]3CCCN3)ncc2c1 |r|
Show InChI InChI=1S/C24H24N4O2/c29-24-14-22(30-17-18-5-2-1-3-6-18)10-12-27(24)21-8-9-23-19(13-21)15-26-28(23)16-20-7-4-11-25-20/h1-3,5-6,8-10,12-15,20,25H,4,7,11,16-17H2/t20-/m0/s1
Reactome pathway
12n/an/an/an/an/an/an/an/a
AMRI
Curated by ChEMBL
Assay Description
Displacement of [3H]4-(benzyloxy)-1-(1-(2-(pyrrolidin-1-yl)ethyl)-1H-indazol-5-yl)pyridin-2(1H)-one from MCH-1 receptor expressed in CHO-K1 cells
Bioorg Med Chem Lett 20: 7015-9 (2010)
Article DOI: 10.1016/j.bmcl.2010.09.039
BindingDB Entry DOI: 10.7270/Q2P55NSM
Potassium voltage-gated channel subfamily H member 2
(Homo sapiens (Human))
BDBM50331249
((S)-4-(benzyloxy)-1-(1-(pyrrolidin-2-ylmethyl)-1H-...)
Show SMILES O=c1cc(OCc2ccccc2)ccn1-c1ccc2n(C[C@@H]3CCCN3)ncc2c1 |r|
Show InChI InChI=1S/C24H24N4O2/c29-24-14-22(30-17-18-5-2-1-3-6-18)10-12-27(24)21-8-9-23-19(13-21)15-26-28(23)16-20-7-4-11-25-20/h1-3,5-6,8-10,12-15,20,25H,4,7,11,16-17H2/t20-/m0/s1
Reactome pathway
n/an/a 2.00E+3n/an/an/an/an/an/a
AMRI
Curated by ChEMBL
Assay Description
Inhibition of human ERG expressed in HEK cells by mini-patch clamp assay
Bioorg Med Chem Lett 20: 7015-9 (2010)
Article DOI: 10.1016/j.bmcl.2010.09.039
BindingDB Entry DOI: 10.7270/Q2P55NSM