BDBM50331276 3-(5-methoxy-1H-indol-2-yl)-1H-pyrazolo[4,3-b]pyridine::CHEMBL1288553
SMILES: COc1ccc2[nH]c(cc2c1)-c1n[nH]c2cccnc12
InChI Key: InChIKey=OCIZTJKUTRHGNG-UHFFFAOYSA-N
Data: 1 IC50
Activity Spreadsheet -- Enzyme Inhibition Constant Data from BindingDB
Found 1 hit for monomerid = 50331276
Trg + Lig
Ki
nM
ΔG°
kcal/mole
IC50
nM
Kd
nM
EC50/IC50
nM
koff
s-1
kon
M-1s-1
pHTemp
°C
Tyrosine-protein kinase ITK/TSK
(Homo sapiens (Human))
BDBM50331276
(3-(5-methoxy-1H-indol-2-yl)-1H-pyrazolo[4,3-b]pyri...)
Show SMILES COc1ccc2[nH]c(cc2c1)-c1n[nH]c2cccnc12
Show InChI InChI=1S/C15H12N4O/c1-20-10-4-5-11-9(7-10)8-13(17-11)15-14-12(18-19-15)3-2-6-16-14/h2-8,17H,1H3,(H,18,19)
Reactome pathway
n/an/a 280n/an/an/an/an/an/a
Nycomed GmbH
Curated by ChEMBL
Assay Description
Inhibition of recombinant GST- tagged full-length ITK expressed in baculovirus expression system after 30 mins by scintillation proximity assay
Bioorg Med Chem Lett 20: 6998-7003 (2010)
Article DOI: 10.1016/j.bmcl.2010.09.119
BindingDB Entry DOI: 10.7270/Q2JD4X29