BDBM50331343 CHEMBL1290164::rac-2-(4-(2-cyclopropylphenylsulfonyl)phenyl)-1,1,1-trifluoropropan-2-ol
SMILES: CC(O)(c1ccc(cc1)S(=O)(=O)c1ccccc1C1CC1)C(F)(F)F
InChI Key: InChIKey=OXRBPNUVVBGCFO-UHFFFAOYSA-N
Data: 2 IC50
Activity Spreadsheet -- Enzyme Inhibition Constant Data from BindingDB
Found 2 hits for monomerid = 50331343
Trg + Lig
Ki
nM
ΔG°
kcal/mole
IC50
nM
Kd
nM
EC50/IC50
nM
koff
s-1
kon
M-1s-1
pHTemp
°C
11-beta-hydroxysteroid dehydrogenase 1
(Homo sapiens (Human))
BDBM50331343
(CHEMBL1290164 | rac-2-(4-(2-cyclopropylphenylsulfo...)
Show SMILES CC(O)(c1ccc(cc1)S(=O)(=O)c1ccccc1C1CC1)C(F)(F)F
Show InChI InChI=1S/C18H17F3O3S/c1-17(22,18(19,20)21)13-8-10-14(11-9-13)25(23,24)16-5-3-2-4-15(16)12-6-7-12/h2-5,8-12,22H,6-7H2,1H3
Reactome pathway
n/an/a 28n/an/an/an/an/an/a
Amgen Inc.
Curated by ChEMBL
Assay Description
Inhibition of human 11beta-HSD1 transfected in HEK293 cells by scintillation proximity assay
Bioorg Med Chem Lett 20: 7071-5 (2010)
Article DOI: 10.1016/j.bmcl.2010.09.097
BindingDB Entry DOI: 10.7270/Q21G0MHX
11-beta-hydroxysteroid dehydrogenase 1
(Homo sapiens (Human))
BDBM50331343
(CHEMBL1290164 | rac-2-(4-(2-cyclopropylphenylsulfo...)
Show SMILES CC(O)(c1ccc(cc1)S(=O)(=O)c1ccccc1C1CC1)C(F)(F)F
Show InChI InChI=1S/C18H17F3O3S/c1-17(22,18(19,20)21)13-8-10-14(11-9-13)25(23,24)16-5-3-2-4-15(16)12-6-7-12/h2-5,8-12,22H,6-7H2,1H3
Reactome pathway
n/an/a 1.20n/an/an/an/an/an/a
Amgen Inc.
Curated by ChEMBL
Assay Description
Inhibition of human 11beta-HSD1 by scintillation proximity assay
Bioorg Med Chem Lett 20: 7071-5 (2010)
Article DOI: 10.1016/j.bmcl.2010.09.097
BindingDB Entry DOI: 10.7270/Q21G0MHX