BDBM50331361 (S)-3'-chloro-4'-(4-(1,1,1-trifluoro-2-hydroxypropan-2-yl)phenylsulfonyl)biphenyl-4-carbonitrile::CHEMBL1289406
SMILES: C[C@](O)(c1ccc(cc1)S(=O)(=O)c1ccc(cc1Cl)-c1ccc(cc1)C#N)C(F)(F)F
InChI Key: InChIKey=ZRLKRSYZYKQTQB-NRFANRHFSA-N
Data: 2 IC50
Activity Spreadsheet -- Enzyme Inhibition Constant Data from BindingDB
Found 2 hits for monomerid = 50331361
Trg + Lig
Ki
nM
ΔG°
kcal/mole
IC50
nM
Kd
nM
EC50/IC50
nM
koff
s-1
kon
M-1s-1
pHTemp
°C
11-beta-hydroxysteroid dehydrogenase 1
(Homo sapiens (Human))
BDBM50331361
((S)-3'-chloro-4'-(4-(1,1,1-trifluoro-2-hydroxyprop...)
Show SMILES C[C@](O)(c1ccc(cc1)S(=O)(=O)c1ccc(cc1Cl)-c1ccc(cc1)C#N)C(F)(F)F |r|
Show InChI InChI=1S/C22H15ClF3NO3S/c1-21(28,22(24,25)26)17-7-9-18(10-8-17)31(29,30)20-11-6-16(12-19(20)23)15-4-2-14(13-27)3-5-15/h2-12,28H,1H3/t21-/m0/s1
Reactome pathway
n/an/a 11n/an/an/an/an/an/a
Amgen Inc.
Curated by ChEMBL
Assay Description
Inhibition of human 11beta-HSD1 transfected in HEK293 cells by scintillation proximity assay
Bioorg Med Chem Lett 20: 7071-5 (2010)
Article DOI: 10.1016/j.bmcl.2010.09.097
BindingDB Entry DOI: 10.7270/Q21G0MHX
11-beta-hydroxysteroid dehydrogenase 1
(Homo sapiens (Human))
BDBM50331361
((S)-3'-chloro-4'-(4-(1,1,1-trifluoro-2-hydroxyprop...)
Show SMILES C[C@](O)(c1ccc(cc1)S(=O)(=O)c1ccc(cc1Cl)-c1ccc(cc1)C#N)C(F)(F)F |r|
Show InChI InChI=1S/C22H15ClF3NO3S/c1-21(28,22(24,25)26)17-7-9-18(10-8-17)31(29,30)20-11-6-16(12-19(20)23)15-4-2-14(13-27)3-5-15/h2-12,28H,1H3/t21-/m0/s1
Reactome pathway
n/an/a 0.900n/an/an/an/an/an/a
Amgen Inc.
Curated by ChEMBL
Assay Description
Inhibition of human 11beta-HSD1 by scintillation proximity assay
Bioorg Med Chem Lett 20: 7071-5 (2010)
Article DOI: 10.1016/j.bmcl.2010.09.097
BindingDB Entry DOI: 10.7270/Q21G0MHX