BDBM50331722 CHEMBL1290636::N-(2-((3S,4S)-4-ethoxy-1-(cis-4-phenylcyclohexyl)pyrrolidin-3-ylamino)-2-oxoethyl)-3-(trifluoromethyl)benzamide
SMILES: CCO[C@H]1CN(C[C@@H]1NC(=O)CNC(=O)c1cccc(c1)C(F)(F)F)[C@H]1CC[C@H](CC1)c1ccccc1
InChI Key: InChIKey=JRKWHQVHPFPWID-PQVVKJAFSA-N
Data: 5 IC50
Activity Spreadsheet -- Enzyme Inhibition Constant Data from BindingDB
Found 5 hits for monomerid = 50331722
Trg + Lig
Ki
nM
ΔG°
kcal/mole
IC50
nM
Kd
nM
EC50/IC50
nM
koff
s-1
kon
M-1s-1
pHTemp
°C
Potassium voltage-gated channel subfamily H member 2
(Homo sapiens (Human))
BDBM50331722
(CHEMBL1290636 | N-(2-((3S,4S)-4-ethoxy-1-(cis-4-ph...)
Show SMILES CCO[C@H]1CN(C[C@@H]1NC(=O)CNC(=O)c1cccc(c1)C(F)(F)F)[C@H]1CC[C@H](CC1)c1ccccc1 |r,wU:3.2,25.26,28.33,wD:7.8,(24.27,-20.7,;23.02,-19.81,;23.17,-18.27,;21.92,-17.37,;20.46,-17.85,;19.55,-16.6,;20.45,-15.36,;21.91,-15.83,;23.25,-15.06,;24.58,-15.83,;24.58,-17.38,;25.92,-15.06,;27.26,-15.83,;28.59,-15.06,;28.59,-13.52,;29.93,-15.83,;31.25,-15.06,;32.59,-15.83,;32.59,-17.38,;31.25,-18.15,;29.93,-17.38,;31.25,-19.69,;29.93,-20.46,;32.59,-20.46,;31.24,-21.22,;18.01,-16.6,;17.24,-17.94,;15.69,-17.94,;14.93,-16.6,;15.7,-15.27,;17.23,-15.28,;13.39,-16.6,;12.62,-15.26,;11.08,-15.26,;10.31,-16.59,;11.08,-17.93,;12.62,-17.93,)|
Show InChI InChI=1S/C28H34F3N3O3/c1-2-37-25-18-34(23-13-11-20(12-14-23)19-7-4-3-5-8-19)17-24(25)33-26(35)16-32-27(36)21-9-6-10-22(15-21)28(29,30)31/h3-10,15,20,23-25H,2,11-14,16-18H2,1H3,(H,32,36)(H,33,35)/t20-,23+,24-,25-/m0/s1
Reactome pathway
n/an/a<1.00E+3n/an/an/an/an/an/a
Incyte Corporation
Curated by ChEMBL
Assay Description
Inhibition of human ERG
Bioorg Med Chem Lett 20: 7473-8 (2010)
Article DOI: 10.1016/j.bmcl.2010.10.020
BindingDB Entry DOI: 10.7270/Q2TQ61S9
C-C chemokine receptor type 2
(Homo sapiens (Human))
BDBM50331722
(CHEMBL1290636 | N-(2-((3S,4S)-4-ethoxy-1-(cis-4-ph...)
Show SMILES CCO[C@H]1CN(C[C@@H]1NC(=O)CNC(=O)c1cccc(c1)C(F)(F)F)[C@H]1CC[C@H](CC1)c1ccccc1 |r,wU:3.2,25.26,28.33,wD:7.8,(24.27,-20.7,;23.02,-19.81,;23.17,-18.27,;21.92,-17.37,;20.46,-17.85,;19.55,-16.6,;20.45,-15.36,;21.91,-15.83,;23.25,-15.06,;24.58,-15.83,;24.58,-17.38,;25.92,-15.06,;27.26,-15.83,;28.59,-15.06,;28.59,-13.52,;29.93,-15.83,;31.25,-15.06,;32.59,-15.83,;32.59,-17.38,;31.25,-18.15,;29.93,-17.38,;31.25,-19.69,;29.93,-20.46,;32.59,-20.46,;31.24,-21.22,;18.01,-16.6,;17.24,-17.94,;15.69,-17.94,;14.93,-16.6,;15.7,-15.27,;17.23,-15.28,;13.39,-16.6,;12.62,-15.26,;11.08,-15.26,;10.31,-16.59,;11.08,-17.93,;12.62,-17.93,)|
Show InChI InChI=1S/C28H34F3N3O3/c1-2-37-25-18-34(23-13-11-20(12-14-23)19-7-4-3-5-8-19)17-24(25)33-26(35)16-32-27(36)21-9-6-10-22(15-21)28(29,30)31/h3-10,15,20,23-25H,2,11-14,16-18H2,1H3,(H,32,36)(H,33,35)/t20-,23+,24-,25-/m0/s1
n/an/a 0.950n/an/an/an/an/an/a
Incyte Corporation
Curated by ChEMBL
Assay Description
Displacement of [125I]MCP1 from human CCR2 after 30 mins by gamma counter
Bioorg Med Chem Lett 20: 7473-8 (2010)
Article DOI: 10.1016/j.bmcl.2010.10.020
BindingDB Entry DOI: 10.7270/Q2TQ61S9
C-C chemokine receptor type 2
(Homo sapiens (Human))
BDBM50331722
(CHEMBL1290636 | N-(2-((3S,4S)-4-ethoxy-1-(cis-4-ph...)
Show SMILES CCO[C@H]1CN(C[C@@H]1NC(=O)CNC(=O)c1cccc(c1)C(F)(F)F)[C@H]1CC[C@H](CC1)c1ccccc1 |r,wU:3.2,25.26,28.33,wD:7.8,(24.27,-20.7,;23.02,-19.81,;23.17,-18.27,;21.92,-17.37,;20.46,-17.85,;19.55,-16.6,;20.45,-15.36,;21.91,-15.83,;23.25,-15.06,;24.58,-15.83,;24.58,-17.38,;25.92,-15.06,;27.26,-15.83,;28.59,-15.06,;28.59,-13.52,;29.93,-15.83,;31.25,-15.06,;32.59,-15.83,;32.59,-17.38,;31.25,-18.15,;29.93,-17.38,;31.25,-19.69,;29.93,-20.46,;32.59,-20.46,;31.24,-21.22,;18.01,-16.6,;17.24,-17.94,;15.69,-17.94,;14.93,-16.6,;15.7,-15.27,;17.23,-15.28,;13.39,-16.6,;12.62,-15.26,;11.08,-15.26,;10.31,-16.59,;11.08,-17.93,;12.62,-17.93,)|
Show InChI InChI=1S/C28H34F3N3O3/c1-2-37-25-18-34(23-13-11-20(12-14-23)19-7-4-3-5-8-19)17-24(25)33-26(35)16-32-27(36)21-9-6-10-22(15-21)28(29,30)31/h3-10,15,20,23-25H,2,11-14,16-18H2,1H3,(H,32,36)(H,33,35)/t20-,23+,24-,25-/m0/s1
n/an/a 6.5n/an/an/an/an/an/a
Incyte Corporation
Curated by ChEMBL
Assay Description
Antagonist activity at human CCR2 assessed as inhibition of MCP1 induced chemotaxis after 30 mins
Bioorg Med Chem Lett 20: 7473-8 (2010)
Article DOI: 10.1016/j.bmcl.2010.10.020
BindingDB Entry DOI: 10.7270/Q2TQ61S9
C-C chemokine receptor type 2
(Mus musculus)
BDBM50331722
(CHEMBL1290636 | N-(2-((3S,4S)-4-ethoxy-1-(cis-4-ph...)
Show SMILES CCO[C@H]1CN(C[C@@H]1NC(=O)CNC(=O)c1cccc(c1)C(F)(F)F)[C@H]1CC[C@H](CC1)c1ccccc1 |r,wU:3.2,25.26,28.33,wD:7.8,(24.27,-20.7,;23.02,-19.81,;23.17,-18.27,;21.92,-17.37,;20.46,-17.85,;19.55,-16.6,;20.45,-15.36,;21.91,-15.83,;23.25,-15.06,;24.58,-15.83,;24.58,-17.38,;25.92,-15.06,;27.26,-15.83,;28.59,-15.06,;28.59,-13.52,;29.93,-15.83,;31.25,-15.06,;32.59,-15.83,;32.59,-17.38,;31.25,-18.15,;29.93,-17.38,;31.25,-19.69,;29.93,-20.46,;32.59,-20.46,;31.24,-21.22,;18.01,-16.6,;17.24,-17.94,;15.69,-17.94,;14.93,-16.6,;15.7,-15.27,;17.23,-15.28,;13.39,-16.6,;12.62,-15.26,;11.08,-15.26,;10.31,-16.59,;11.08,-17.93,;12.62,-17.93,)|
Show InChI InChI=1S/C28H34F3N3O3/c1-2-37-25-18-34(23-13-11-20(12-14-23)19-7-4-3-5-8-19)17-24(25)33-26(35)16-32-27(36)21-9-6-10-22(15-21)28(29,30)31/h3-10,15,20,23-25H,2,11-14,16-18H2,1H3,(H,32,36)(H,33,35)/t20-,23+,24-,25-/m0/s1
Reactome pathway
n/an/a 1.90n/an/an/an/an/an/a
Incyte Corporation
Curated by ChEMBL
Assay Description
Displacement of [125I]MCP1 from mouse CCR2 after 30 mins by gamma counter
Bioorg Med Chem Lett 20: 7473-8 (2010)
Article DOI: 10.1016/j.bmcl.2010.10.020
BindingDB Entry DOI: 10.7270/Q2TQ61S9
C-C chemokine receptor type 2
(Mus musculus)
BDBM50331722
(CHEMBL1290636 | N-(2-((3S,4S)-4-ethoxy-1-(cis-4-ph...)
Show SMILES CCO[C@H]1CN(C[C@@H]1NC(=O)CNC(=O)c1cccc(c1)C(F)(F)F)[C@H]1CC[C@H](CC1)c1ccccc1 |r,wU:3.2,25.26,28.33,wD:7.8,(24.27,-20.7,;23.02,-19.81,;23.17,-18.27,;21.92,-17.37,;20.46,-17.85,;19.55,-16.6,;20.45,-15.36,;21.91,-15.83,;23.25,-15.06,;24.58,-15.83,;24.58,-17.38,;25.92,-15.06,;27.26,-15.83,;28.59,-15.06,;28.59,-13.52,;29.93,-15.83,;31.25,-15.06,;32.59,-15.83,;32.59,-17.38,;31.25,-18.15,;29.93,-17.38,;31.25,-19.69,;29.93,-20.46,;32.59,-20.46,;31.24,-21.22,;18.01,-16.6,;17.24,-17.94,;15.69,-17.94,;14.93,-16.6,;15.7,-15.27,;17.23,-15.28,;13.39,-16.6,;12.62,-15.26,;11.08,-15.26,;10.31,-16.59,;11.08,-17.93,;12.62,-17.93,)|
Show InChI InChI=1S/C28H34F3N3O3/c1-2-37-25-18-34(23-13-11-20(12-14-23)19-7-4-3-5-8-19)17-24(25)33-26(35)16-32-27(36)21-9-6-10-22(15-21)28(29,30)31/h3-10,15,20,23-25H,2,11-14,16-18H2,1H3,(H,32,36)(H,33,35)/t20-,23+,24-,25-/m0/s1
Reactome pathway
n/an/a 14n/an/an/an/an/an/a
Incyte Corporation
Curated by ChEMBL
Assay Description
Antagonist activity at mouse CCR2 assessed as inhibition of MCP1 induced chemotaxis after 30 mins
Bioorg Med Chem Lett 20: 7473-8 (2010)
Article DOI: 10.1016/j.bmcl.2010.10.020
BindingDB Entry DOI: 10.7270/Q2TQ61S9