BDBM50331781 (S)-N-((S)-1-cyano-2-phenylethyl)-4-fluoro-4-methyl-2-((S)-2,2,2-trifluoro-1-(4'-(methylsulfonyl)biphenyl-4-yl)ethylamino)pentanamide::CHEMBL1289440
SMILES: CC(C)(F)C[C@H](N[C@@H](c1ccc(cc1)-c1ccc(cc1)S(C)(=O)=O)C(F)(F)F)C(=O)N[C@@H](Cc1ccccc1)C#N
InChI Key: InChIKey=IYGWXNGZSDQPFR-URORMMCBSA-N
Data: 4 IC50
Activity Spreadsheet -- Enzyme Inhibition Constant Data from BindingDB
Found 4 hits for monomerid = 50331781
Trg + Lig
Ki
nM
ΔG°
kcal/mole
IC50
nM
Kd
nM
EC50/IC50
nM
koff
s-1
kon
M-1s-1
pHTemp
°C
Procathepsin L
(Homo sapiens (Human))
BDBM50331781
((S)-N-((S)-1-cyano-2-phenylethyl)-4-fluoro-4-methy...)
Show SMILES CC(C)(F)C[C@H](N[C@@H](c1ccc(cc1)-c1ccc(cc1)S(C)(=O)=O)C(F)(F)F)C(=O)N[C@@H](Cc1ccccc1)C#N |r|
Show InChI InChI=1S/C30H31F4N3O3S/c1-29(2,31)18-26(28(38)36-24(19-35)17-20-7-5-4-6-8-20)37-27(30(32,33)34)23-11-9-21(10-12-23)22-13-15-25(16-14-22)41(3,39)40/h4-16,24,26-27,37H,17-18H2,1-3H3,(H,36,38)/t24-,26-,27-/m0/s1
Reactome pathway
n/an/a 966n/an/an/an/an/an/a
Merck Research Laboratories
Curated by ChEMBL
Assay Description
Inhibition of human Cat L
Bioorg Med Chem Lett 20: 7444-9 (2010)
Article DOI: 10.1016/j.bmcl.2010.10.015
BindingDB Entry DOI: 10.7270/Q29S1R8D
Cathepsin F
(Homo sapiens (Human))
BDBM50331781
((S)-N-((S)-1-cyano-2-phenylethyl)-4-fluoro-4-methy...)
Show SMILES CC(C)(F)C[C@H](N[C@@H](c1ccc(cc1)-c1ccc(cc1)S(C)(=O)=O)C(F)(F)F)C(=O)N[C@@H](Cc1ccccc1)C#N |r|
Show InChI InChI=1S/C30H31F4N3O3S/c1-29(2,31)18-26(28(38)36-24(19-35)17-20-7-5-4-6-8-20)37-27(30(32,33)34)23-11-9-21(10-12-23)22-13-15-25(16-14-22)41(3,39)40/h4-16,24,26-27,37H,17-18H2,1-3H3,(H,36,38)/t24-,26-,27-/m0/s1
Reactome pathway
n/an/a 67n/an/an/an/an/an/a
Merck Research Laboratories
Curated by ChEMBL
Assay Description
Inhibition of human Cat F expressed in rabbit HIG82 cells
Bioorg Med Chem Lett 20: 7444-9 (2010)
Article DOI: 10.1016/j.bmcl.2010.10.015
BindingDB Entry DOI: 10.7270/Q29S1R8D
Cathepsin B
(Homo sapiens (Human))
BDBM50331781
((S)-N-((S)-1-cyano-2-phenylethyl)-4-fluoro-4-methy...)
Show SMILES CC(C)(F)C[C@H](N[C@@H](c1ccc(cc1)-c1ccc(cc1)S(C)(=O)=O)C(F)(F)F)C(=O)N[C@@H](Cc1ccccc1)C#N |r|
Show InChI InChI=1S/C30H31F4N3O3S/c1-29(2,31)18-26(28(38)36-24(19-35)17-20-7-5-4-6-8-20)37-27(30(32,33)34)23-11-9-21(10-12-23)22-13-15-25(16-14-22)41(3,39)40/h4-16,24,26-27,37H,17-18H2,1-3H3,(H,36,38)/t24-,26-,27-/m0/s1
Reactome pathway
n/an/a 122n/an/an/an/an/an/a
Merck Research Laboratories
Curated by ChEMBL
Assay Description
Inhibition of human Cat B in HepG2 cells
Bioorg Med Chem Lett 20: 7444-9 (2010)
Article DOI: 10.1016/j.bmcl.2010.10.015
BindingDB Entry DOI: 10.7270/Q29S1R8D
Cruzipain
(Trypanosoma cruzi)
BDBM50331781
((S)-N-((S)-1-cyano-2-phenylethyl)-4-fluoro-4-methy...)
Show SMILES CC(C)(F)C[C@H](N[C@@H](c1ccc(cc1)-c1ccc(cc1)S(C)(=O)=O)C(F)(F)F)C(=O)N[C@@H](Cc1ccccc1)C#N |r|
Show InChI InChI=1S/C30H31F4N3O3S/c1-29(2,31)18-26(28(38)36-24(19-35)17-20-7-5-4-6-8-20)37-27(30(32,33)34)23-11-9-21(10-12-23)22-13-15-25(16-14-22)41(3,39)40/h4-16,24,26-27,37H,17-18H2,1-3H3,(H,36,38)/t24-,26-,27-/m0/s1
n/an/a 8n/an/an/an/an/an/a
Merck Research Laboratories
Curated by ChEMBL
Assay Description
Inhibition of trypanosoma cruzi Cruzipain
Bioorg Med Chem Lett 20: 7444-9 (2010)
Article DOI: 10.1016/j.bmcl.2010.10.015
BindingDB Entry DOI: 10.7270/Q29S1R8D