BDBM50331843 2,2,2-trifluoro-N-(5-phenyl-1,3,4-thiadiazol-2-yl)acetamide::CHEMBL1288928
SMILES: FC(F)(F)C(=O)Nc1nnc(s1)-c1ccccc1
InChI Key: InChIKey=HVJQDWUYSVRXKC-UHFFFAOYSA-N
Data: 1 IC50
Activity Spreadsheet -- Enzyme Inhibition Constant Data from BindingDB
Found 1 hit for monomerid = 50331843
Trg + Lig
Ki
nM
ΔG°
kcal/mole
IC50
nM
Kd
nM
EC50/IC50
nM
koff
s-1
kon
M-1s-1
pHTemp
°C
Endochitinase A1
(Neosartorya fumigata (Aspergillus fumigatus))
BDBM50331843
(2,2,2-trifluoro-N-(5-phenyl-1,3,4-thiadiazol-2-yl)...)
Show SMILES FC(F)(F)C(=O)Nc1nnc(s1)-c1ccccc1
Show InChI InChI=1S/C10H6F3N3OS/c11-10(12,13)8(17)14-9-16-15-7(18-9)6-4-2-1-3-5-6/h1-5H,(H,14,16,17)
n/an/a 3.20E+5n/an/an/an/an/an/a
University of Dundee
Curated by ChEMBL
Assay Description
Inhibition of Aspergillus fumigatus ChiA1 expressed in Pichia pastoris after 70 mins
Bioorg Med Chem 18: 8334-40 (2010)
Article DOI: 10.1016/j.bmc.2010.09.062
BindingDB Entry DOI: 10.7270/Q2NZ87WR