null
SMILES: FC(F)(F)c1nnc(NC(=O)CCl)s1
InChI Key: InChIKey=IRJUPVZWCCPWBT-UHFFFAOYSA-N
Activity Spreadsheet -- Enzyme Inhibition Constant Data from BindingDB
Found 1 hit for monomerid = 50331849
Trg + Lig
Ki
nM
ΔG°
kcal/mole
IC50
nM
Kd
nM
EC50/IC50
nM
koff
s-1
kon
M-1s-1
pHTemp
°C
Endochitinase A1
(Neosartorya fumigata (Aspergillus fumigatus))
BDBM50331849
(2-chloro-N-(5-(trifluoromethyl)-1,3,4-thiadiazol-2...)
Show SMILES FC(F)(F)c1nnc(NC(=O)CCl)s1
Show InChI InChI=1S/C5H3ClF3N3OS/c6-1-2(13)10-4-12-11-3(14-4)5(7,8)9/h1H2,(H,10,12,13)
n/an/a>1.00E+6n/an/an/an/an/an/a
University of Dundee
Curated by ChEMBL
Assay Description
Inhibition of Aspergillus fumigatus ChiA1 expressed in Pichia pastoris after 70 mins
Bioorg Med Chem 18: 8334-40 (2010)
Article DOI: 10.1016/j.bmc.2010.09.062
BindingDB Entry DOI: 10.7270/Q2NZ87WR