null
SMILES: FC(F)(F)[C@H]1C[C@H](Nc2c(cnn12)C(=O)NC12CC3CC(CC(C3)C1)C2)c1cccc(Cl)c1
InChI Key: InChIKey=CWFQEEBEAWPVIP-JFUWQCHASA-N
Activity Spreadsheet -- Enzyme Inhibition Constant Data from BindingDB
Found 1 hit for monomerid = 50331952
Trg + Lig
Ki
nM
ΔG°
kcal/mole
IC50
nM
Kd
nM
EC50/IC50
nM
koff
s-1
kon
M-1s-1
pHTemp
°C
Extracellular calcium-sensing receptor
(Homo sapiens (Human))
BDBM50331952
(CHEMBL1289679 | N-(1-Adamantyl)-5-(3-chlorophenyl)...)
Show SMILES FC(F)(F)[C@H]1C[C@H](Nc2c(cnn12)C(=O)NC12CC3CC(CC(C3)C1)C2)c1cccc(Cl)c1 |r,THB:21:20:17:23.22.24,21:22:19.20.25:17,24:22:19:25.16.17,24:16:19:23.21.22,15:16:19:23.21.22|
Show InChI InChI=1S/C24H26ClF3N4O/c25-17-3-1-2-16(7-17)19-8-20(24(26,27)28)32-21(30-19)18(12-29-32)22(33)31-23-9-13-4-14(10-23)6-15(5-13)11-23/h1-3,7,12-15,19-20,30H,4-6,8-11H2,(H,31,33)/t13?,14?,15?,19-,20+,23?/m0/s1
n/an/a 320n/an/an/an/an/an/a
Takeda Pharmaceutical Company Limited
Curated by ChEMBL
Assay Description
Antagonist activity at CaSR expressed in CHO cells assessed as [35S]-GTPgammaS binding by scintillation counting
Bioorg Med Chem 18: 8501-11 (2010)
Article DOI: 10.1016/j.bmc.2010.10.035
BindingDB Entry DOI: 10.7270/Q2CJ8DRD