null
SMILES: COC(=O)c1sccc1NC(=O)Cc1ccc(cc1)-n1ccnc1
InChI Key: InChIKey=NVJSHBLBHMSEFL-UHFFFAOYSA-N
Activity Spreadsheet -- Enzyme Inhibition Constant Data from BindingDB
Found 3 hits for monomerid = 50332045
Trg + Lig
Ki
nM
ΔG°
kcal/mole
IC50
nM
Kd
nM
EC50/IC50
nM
koff
s-1
kon
M-1s-1
pHTemp
°C
Mitogen-activated protein kinase 8
(Homo sapiens (Human))
BDBM50332045
(CHEMBL1288158 | methyl 3-(2-(4-(1H-imidazol-1-yl)p...)
Show SMILES COC(=O)c1sccc1NC(=O)Cc1ccc(cc1)-n1ccnc1
Show InChI InChI=1S/C17H15N3O3S/c1-23-17(22)16-14(6-9-24-16)19-15(21)10-12-2-4-13(5-3-12)20-8-7-18-11-20/h2-9,11H,10H2,1H3,(H,19,21)
NCI pathway
Reactome pathway
n/an/a 1.00E+3n/an/an/an/an/an/a
Elan Pharmaceuticals
Curated by ChEMBL
Assay Description
Inhibition of recombinant JNK1 after 60 mins by TR-FRET assay
Bioorg Med Chem Lett 20: 7303-7 (2010)
Article DOI: 10.1016/j.bmcl.2010.10.066
BindingDB Entry DOI: 10.7270/Q20865JW
Mitogen-activated protein kinase 10
(Homo sapiens (Human))
BDBM50332045
(CHEMBL1288158 | methyl 3-(2-(4-(1H-imidazol-1-yl)p...)
Show SMILES COC(=O)c1sccc1NC(=O)Cc1ccc(cc1)-n1ccnc1
Show InChI InChI=1S/C17H15N3O3S/c1-23-17(22)16-14(6-9-24-16)19-15(21)10-12-2-4-13(5-3-12)20-8-7-18-11-20/h2-9,11H,10H2,1H3,(H,19,21)
NCI pathway
Reactome pathway
n/an/a 1.60E+3n/an/an/an/an/an/a
Elan Pharmaceuticals
Curated by ChEMBL
Assay Description
Inhibition of recombinant JNK3 after 60 mins by TR-FRET assay
Bioorg Med Chem Lett 20: 7303-7 (2010)
Article DOI: 10.1016/j.bmcl.2010.10.066
BindingDB Entry DOI: 10.7270/Q20865JW
Mitogen-activated protein kinase 9
(Homo sapiens (Human))
BDBM50332045
(CHEMBL1288158 | methyl 3-(2-(4-(1H-imidazol-1-yl)p...)
Show SMILES COC(=O)c1sccc1NC(=O)Cc1ccc(cc1)-n1ccnc1
Show InChI InChI=1S/C17H15N3O3S/c1-23-17(22)16-14(6-9-24-16)19-15(21)10-12-2-4-13(5-3-12)20-8-7-18-11-20/h2-9,11H,10H2,1H3,(H,19,21)
NCI pathway
Reactome pathway
n/an/a>5.00E+4n/an/an/an/an/an/a
Elan Pharmaceuticals
Curated by ChEMBL
Assay Description
Inhibition of recombinant JNK2 after 60 mins by TR-FRET assay
Bioorg Med Chem Lett 20: 7303-7 (2010)
Article DOI: 10.1016/j.bmcl.2010.10.066
BindingDB Entry DOI: 10.7270/Q20865JW