null
SMILES: NC(=O)c1sccc1NC(=O)Cc1ccccc1
InChI Key: InChIKey=INZMHUJPOZBGRG-UHFFFAOYSA-N
Activity Spreadsheet -- Enzyme Inhibition Constant Data from BindingDB
Found 3 hits for monomerid = 50332055
Trg + Lig
Ki
nM
ΔG°
kcal/mole
IC50
nM
Kd
nM
EC50/IC50
nM
koff
s-1
kon
M-1s-1
pHTemp
°C
Mitogen-activated protein kinase 8
(Homo sapiens (Human))
BDBM50332055
(3-(2-phenylacetamido)thiophene-2-carboxamide | CHE...)
Show SMILES NC(=O)c1sccc1NC(=O)Cc1ccccc1
Show InChI InChI=1S/C13H12N2O2S/c14-13(17)12-10(6-7-18-12)15-11(16)8-9-4-2-1-3-5-9/h1-7H,8H2,(H2,14,17)(H,15,16)
NCI pathway
Reactome pathway
n/an/a 2.60E+3n/an/an/an/an/an/a
Elan Pharmaceuticals
Curated by ChEMBL
Assay Description
Inhibition of recombinant JNK1 after 60 mins by TR-FRET assay
Bioorg Med Chem Lett 20: 7303-7 (2010)
Article DOI: 10.1016/j.bmcl.2010.10.066
BindingDB Entry DOI: 10.7270/Q20865JW
Mitogen-activated protein kinase 10
(Homo sapiens (Human))
BDBM50332055
(3-(2-phenylacetamido)thiophene-2-carboxamide | CHE...)
Show SMILES NC(=O)c1sccc1NC(=O)Cc1ccccc1
Show InChI InChI=1S/C13H12N2O2S/c14-13(17)12-10(6-7-18-12)15-11(16)8-9-4-2-1-3-5-9/h1-7H,8H2,(H2,14,17)(H,15,16)
NCI pathway
Reactome pathway
n/an/a 4.40E+3n/an/an/an/an/an/a
Elan Pharmaceuticals
Curated by ChEMBL
Assay Description
Inhibition of recombinant JNK3 after 60 mins by TR-FRET assay
Bioorg Med Chem Lett 20: 7303-7 (2010)
Article DOI: 10.1016/j.bmcl.2010.10.066
BindingDB Entry DOI: 10.7270/Q20865JW
Mitogen-activated protein kinase 9
(Homo sapiens (Human))
BDBM50332055
(3-(2-phenylacetamido)thiophene-2-carboxamide | CHE...)
Show SMILES NC(=O)c1sccc1NC(=O)Cc1ccccc1
Show InChI InChI=1S/C13H12N2O2S/c14-13(17)12-10(6-7-18-12)15-11(16)8-9-4-2-1-3-5-9/h1-7H,8H2,(H2,14,17)(H,15,16)
NCI pathway
Reactome pathway
n/an/a>5.00E+4n/an/an/an/an/an/a
Elan Pharmaceuticals
Curated by ChEMBL
Assay Description
Inhibition of recombinant JNK2 after 60 mins by TR-FRET assay
Bioorg Med Chem Lett 20: 7303-7 (2010)
Article DOI: 10.1016/j.bmcl.2010.10.066
BindingDB Entry DOI: 10.7270/Q20865JW