null
SMILES: CC(=C)c1sccc1NC(=O)Cc1ccccc1
InChI Key: InChIKey=HAYQEKZBDCILER-UHFFFAOYSA-N
Activity Spreadsheet -- Enzyme Inhibition Constant Data from BindingDB
Found 1 hit for monomerid = 50332096
Trg + Lig
Ki
nM
ΔG°
kcal/mole
IC50
nM
Kd
nM
EC50/IC50
nM
koff
s-1
kon
M-1s-1
pHTemp
°C
Mitogen-activated protein kinase 10
(Homo sapiens (Human))
BDBM50332096
(2-phenyl-N-(2-(prop-1-en-2-yl)thiophen-3-yl)acetam...)
Show SMILES CC(=C)c1sccc1NC(=O)Cc1ccccc1
Show InChI InChI=1S/C15H15NOS/c1-11(2)15-13(8-9-18-15)16-14(17)10-12-6-4-3-5-7-12/h3-9H,1,10H2,2H3,(H,16,17)
NCI pathway
Reactome pathway
n/an/a>5.00E+4n/an/an/an/an/an/a
Elan Pharmaceuticals
Curated by ChEMBL
Assay Description
Inhibition of recombinant JNK3 after 60 mins by TR-FRET assay
Bioorg Med Chem Lett 20: 7303-7 (2010)
Article DOI: 10.1016/j.bmcl.2010.10.066
BindingDB Entry DOI: 10.7270/Q20865JW